program: Orca
programVersion: 5.0.2
elementType: O O O O N C C C C C C C C C C C C C C C C C C C H H H H H H H H H H H H H H H H H H H H H H H H H
charge: 0
multiplicity: 1
keywords: wb97x-d3
keywords: def2-TZVPP
keywords: def2/J RIJCOSX
keywords: DEFGRID2
keywords: scfconv7
keywords: smallprint printgap noloewdin
keywords: NOSOSCF
formula: C19H25NO4
InChI: InChI=1/C19H25NO4/c1-11(2)9-14-15(19(14,3)4)18(23)24-10-20-16(21)12-7-5-6-8-13(12)17(20)22/h9,14-15H,5-8,10H2,1-4H3
49 atoms
O  0.291866 1.397696 0.084468
O  1.47165 1.166279 -1.811091
O  -2.97503 2.755059 1.227108
O  -1.556983 -0.507961 -1.596956
N  -1.988996 1.366302 -0.331635
C  2.605271 -1.296539 -0.217899
C  3.61652 -0.194073 -0.267203
C  2.217923 0.116932 0.202829
C  2.09405 -1.88461 -1.509401
C  2.691208 -2.305176 0.899426
C  4.737592 -0.113895 0.703734
C  1.324946 0.930809 -0.635384
C  5.956158 -0.618884 0.495235
C  -0.771627 2.067541 -0.580013
C  7.038313 -0.493568 1.523179
C  6.341559 -1.350734 -0.753106
C  -3.974685 0.644957 0.583694
C  -3.558157 -0.316691 -0.242041
C  -5.240616 0.6171 1.355984
C  -4.275338 -1.587521 -0.503253
C  -6.142406 -0.491455 0.809935
C  -5.365294 -1.781213 0.552598
C  -2.96825 1.735183 0.584159
C  -2.265766 0.102187 -0.834251
H  3.839535 0.158097 -1.270644
H  2.081215 0.248455 1.270809
H  2.675228 -2.775653 -1.754908
H  2.175279 -1.204959 -2.354634
H  1.049813 -2.190986 -1.418404
H  3.410008 -3.087517 0.645692
H  1.72364 -2.783712 1.061391
H  3.00477 -1.860073 1.843245
H  4.538069 0.386035 1.647182
H  -0.591484 2.137266 -1.650099
H  -0.856799 3.071968 -0.171664
H  6.700314 0.037017 2.41311
H  7.903437 0.03913 1.120184
H  7.399313 -1.477861 1.832088
H  5.53577 -1.413353 -1.482842
H  6.655618 -2.370565 -0.516293
H  7.197053 -0.871469 -1.235917
H  -5.015668 0.448569 2.414071
H  -5.738583 1.58817 1.30338
H  -4.708958 -1.557326 -1.508156
H  -3.574855 -2.426252 -0.501527
H  -6.957043 -0.676671 1.510864
H  -6.601413 -0.153421 -0.123505
H  -6.044815 -2.572496 0.234194
H  -4.905081 -2.117727 1.485907
elementType: O N C H
totalener: -1094.86857020 hartree
nucrepener: 2068.20996131 hartree
electener: -3163.07853151 hartree
oneelecener: -5598.87546327 hartree
twoeener: 2435.79693176 hartree
cpcmener: -0.03753237 hartree
kineticenergy: 1090.04265668 hartree
xcener: -105.974088068382 hartree
chargesum: -0.0000000
charge: -0.286465 -0.480901 -0.434464 -0.441747 -0.095186 0.138108 -0.016034 -0.109274 -0.302870 -0.274463 -0.257339 0.413520 -0.040052 0.080433 -0.230499 -0.249468 -0.079671 -0.056400 -0.072668 -0.070387 -0.135404 -0.136010 0.345259 0.336386 0.101318 0.095945 0.099894 0.096701 0.097711 0.097445 0.101400 0.093525 0.124265 0.143021 0.125727 0.090331 0.095660 0.094190 0.087760 0.097623 0.100824 0.102587 0.093944 0.101543 0.093919 0.081264 0.078819 0.081271 0.078911
qa: -0.2865 -0.4809 -0.4345 -0.4417 -0.0952 0.1381 -0.0160 -0.1093 -0.3029 -0.2745 -0.2573 0.4135 -0.0401 0.0804 -0.2305 -0.2495 -0.0797 -0.0564 -0.0727 -0.0704 -0.1354 -0.1360 0.3453 0.3364 0.1013 0.0959 0.0999 0.0967 0.0977 0.0974 0.1014 0.0935 0.1243 0.1430 0.1257 0.0903 0.0957 0.0942 0.0878 0.0976 0.1008 0.1026 0.0939 0.1015 0.0939 0.0813 0.0788 0.0813 0.0789
va: 2.1087 2.0243 2.0781 2.0655 3.1024 3.6583 3.8067 3.8638 3.8936 3.9081 3.8587 4.1644 3.7052 3.8557 3.9277 3.9372 3.7149 3.6760 3.9175 3.9166 3.9142 3.9159 4.1954 4.1863 1.0237 1.0352 1.0020 1.0155 1.0066 1.0009 1.0027 1.0017 1.0059 1.0152 1.0157 1.0071 0.9955 0.9960 1.0079 0.9972 0.9990 1.0048 1.0153 1.0048 1.0153 1.0093 1.0067 1.0093 1.0067
dispcorr: -0.023275032 hartree
energy: -1094.891845235625
dipole: 19.71464 -20.91874 -1.20410 -20.00853 18.58191 -1.42662 4.98326 -3.82370 1.15956
magnitude: 2.19765 au
magnitude: 5.58599 debye
