program: Orca
programVersion: 5.0.2
elementType: O O O O N C C C C C C C C C C C C C C C C C C C H H H H H H H H H H H H H H H H H H H H H H H H H
charge: 0
multiplicity: 1
keywords: wb97x-d3
keywords: def2-TZVPP
keywords: def2/J RIJCOSX
keywords: DEFGRID2
keywords: scfconv7
keywords: smallprint printgap noloewdin
keywords: NOSOSCF
formula: C19H25NO4
InChI: InChI=1/C19H25NO4/c1-11(2)9-14-15(19(14,3)4)18(23)24-10-20-16(21)12-7-5-6-8-13(12)17(20)22/h9,14-15H,5-8,10H2,1-4H3
49 atoms
O  0.448196 1.717324 -0.174966
O  1.572567 1.660133 1.769661
O  -3.040654 2.230495 -1.367411
O  -1.002346 -0.424521 1.703548
N  -1.779627 1.197576 0.266025
C  4.041389 1.228541 -0.136416
C  3.613844 -0.067663 0.453694
C  2.5782 0.810245 -0.227125
C  4.468005 2.348476 0.779043
C  4.78088 1.222852 -1.452357
C  3.98611 -1.375525 -0.145509
C  1.523098 1.431309 0.584122
C  3.183094 -2.439662 -0.221835
C  -0.746368 2.166641 0.448396
C  3.649308 -3.724879 -0.83357
C  1.770868 -2.443603 0.277125
C  -3.589563 0.021655 -0.538779
C  -2.991886 -0.759304 0.361917
C  -4.814176 -0.332674 -1.295951
C  -3.456232 -2.108423 0.765807
C  -5.087277 -1.831296 -1.153517
C  -4.89291 -2.315498 0.283409
C  -2.823307 1.287785 -0.648497
C  -1.807615 -0.041658 0.890712
H  3.5390 -0.060432 1.538773
H  2.256599 0.493232 -1.212476
H  4.235724 3.322625 0.344615
H  5.549034 2.304787 0.923773
H  4.008287 2.29763 1.763228
H  5.850614 1.077359 -1.289812
H  4.652276 2.176352 -1.967427
H  4.436025 0.435917 -2.122953
H  5.000104 -1.462676 -0.526501
H  -1.050909 3.091435 -0.035724
H  -0.596946 2.358728 1.507993
H  3.60266 -4.54207 -0.109535
H  4.672668 -3.657131 -1.201889
H  3.00698 -4.015788 -1.668541
H  1.067123 -2.526207 -0.555649
H  1.51391 -1.552924 0.845842
H  1.592622 -3.311414 0.916339
H  -5.655172 0.252367 -0.910633
H  -4.708141 -0.052765 -2.346516
H  -2.789737 -2.861839 0.333868
H  -3.384928 -2.227705 1.849265
H  -6.102217 -2.048921 -1.486845
H  -4.414258 -2.383571 -1.814595
H  -5.155239 -3.370971 0.360747
H  -5.574994 -1.772905 0.943508
elementType: O N C H
totalener: -1094.86813187 hartree
nucrepener: 2113.22526558 hartree
electener: -3208.09339745 hartree
oneelecener: -5688.90476947 hartree
twoeener: 2480.81137201 hartree
cpcmener: -0.03777963 hartree
kineticenergy: 1090.03914445 hartree
xcener: -105.974056671523 hartree
chargesum: -0.0000000
charge: -0.288255 -0.486619 -0.434499 -0.442523 -0.090336 0.154121 -0.003631 -0.121642 -0.282431 -0.283968 -0.310593 0.413235 -0.008281 0.078148 -0.230064 -0.234630 -0.081029 -0.055501 -0.071602 -0.073456 -0.136467 -0.134152 0.343643 0.337870 0.103773 0.096178 0.100841 0.095986 0.091961 0.099642 0.098425 0.094110 0.124976 0.126332 0.141720 0.097125 0.089852 0.095221 0.103375 0.068750 0.102772 0.102397 0.093828 0.102737 0.093448 0.080996 0.078697 0.080800 0.078722
qa: -0.2883 -0.4866 -0.4345 -0.4425 -0.0903 0.1541 -0.0036 -0.1216 -0.2824 -0.2840 -0.3106 0.4132 -0.0083 0.0781 -0.2301 -0.2346 -0.0810 -0.0555 -0.0716 -0.0735 -0.1365 -0.1342 0.3436 0.3379 0.1038 0.0962 0.1008 0.0960 0.0920 0.0996 0.0984 0.0941 0.1250 0.1263 0.1417 0.0971 0.0899 0.0952 0.1034 0.0687 0.1028 0.1024 0.0938 0.1027 0.0934 0.0810 0.0787 0.0808 0.0787
va: 2.1023 2.0145 2.0785 2.0618 3.1064 3.6908 3.8034 3.8104 3.8955 3.9086 3.8987 4.1294 3.7124 3.8589 3.9310 3.9409 3.7134 3.6868 3.9162 3.9219 3.9187 3.9163 4.1951 4.1722 1.0259 1.0316 0.9989 1.0009 1.0174 0.9997 1.0029 1.0016 1.0034 1.0165 1.0153 0.9961 1.0060 0.9961 0.9977 1.0137 1.0011 1.0044 1.0153 1.0046 1.0156 1.0092 1.0064 1.0095 1.0067
dispcorr: -0.024016328 hartree
energy: -1094.892148199405
dipole: 14.61686 -15.75887 -1.14201 -16.72318 15.21859 -1.50460 -6.01595 4.79554 -1.22041
magnitude: 2.24887 au
magnitude: 5.71617 debye
