program: Orca
programVersion: 5.0.2
elementType: O O O O N C C C C C C C C C C C C C C C C C C C H H H H H H H H H H H H H H H H H H H H H H H H H
charge: 0
multiplicity: 1
keywords: wb97x-d3
keywords: def2-TZVPP
keywords: def2/J RIJCOSX
keywords: DEFGRID2
keywords: scfconv7
keywords: smallprint printgap noloewdin
keywords: NOSOSCF
formula: C19H25NO4
InChI: InChI=1/C19H25NO4/c1-11(2)9-14-15(19(14,3)4)18(23)24-10-20-16(21)12-7-5-6-8-13(12)17(20)22/h9,14-15H,5-8,10H2,1-4H3
49 atoms
O  0.546591 1.550077 -0.143392
O  1.645337 3.169342 -1.219623
O  -2.002366 0.841603 -2.2697
O  -1.801723 1.144015 2.255472
N  -1.735707 1.364905 -0.038929
C  3.567568 0.948629 0.661936
C  2.806308 -0.172278 0.010993
C  2.817538 1.194056 -0.634677
C  3.03559 1.512436 1.95612
C  5.073514 0.978348 0.577301
C  3.469987 -1.302399 -0.669696
C  1.634239 2.075919 -0.699517
C  3.21314 -2.600532 -0.476011
C  -0.669928 2.296099 -0.160569
C  3.946107 -3.65321 -1.251746
C  2.205151 -3.138625 0.493854
C  -3.159267 -0.379801 -0.529674
C  -3.10016 -0.292164 0.800334
C  -3.995782 -1.341406 -1.286996
C  -3.849755 -1.155562 1.744612
C  -5.028387 -1.965558 -0.347219
C  -4.411899 -2.363628 0.993052
C  -2.257776 0.642457 -1.108752
C  -2.158706 0.795642 1.158375
H  1.884405 -0.422697 0.522608
H  3.459113 1.320956 -1.500794
H  3.288602 2.570053 2.054386
H  3.486941 0.988107 2.80055
H  1.9555 1.414157 2.056088
H  5.45088 0.638787 -0.386314
H  5.510116 0.342083 1.34977
H  5.444948 1.992128 0.737317
H  4.22976 -1.040837 -1.400839
H  -0.783056 2.851677 -1.089391
H  -0.689448 2.993534 0.675566
H  4.649772 -3.225645 -1.965659
H  3.249011 -4.289337 -1.803592
H  4.501758 -4.315576 -0.582805
H  2.6674 -3.884316 1.145146
H  1.39706 -3.652501 -0.033674
H  1.754822 -2.380997 1.132038
H  -4.482792 -0.841785 -2.127365
H  -3.352435 -2.111667 -1.723887
H  -3.205531 -1.471616 2.568022
H  -4.657392 -0.572784 2.198655
H  -5.835753 -1.248278 -0.175703
H  -5.478885 -2.835423 -0.826067
H  -3.608338 -3.084788 0.820819
H  -5.155403 -2.864603 1.613717
elementType: O N C H
totalener: -1094.86834051 hartree
nucrepener: 2106.60340708 hartree
electener: -3201.47174759 hartree
oneelecener: -5674.83681982 hartree
twoeener: 2473.36507223 hartree
cpcmener: -0.03890103 hartree
kineticenergy: 1090.04305076 hartree
xcener: -105.973107617096 hartree
chargesum: 0.0000000
charge: -0.269064 -0.490603 -0.433616 -0.436577 -0.119046 0.091059 0.082669 -0.138417 -0.262697 -0.275984 -0.303515 0.441731 -0.043080 0.076630 -0.222427 -0.257521 -0.062937 -0.057142 -0.072843 -0.070796 -0.134679 -0.134664 0.335827 0.331819 0.094534 0.098519 0.099967 0.096338 0.084147 0.089424 0.097240 0.098612 0.122452 0.128879 0.142772 0.089353 0.093306 0.094385 0.095160 0.099181 0.090528 0.093707 0.103235 0.093854 0.101770 0.078598 0.080206 0.078678 0.081028
qa: -0.2691 -0.4906 -0.4336 -0.4366 -0.1190 0.0911 0.0827 -0.1384 -0.2627 -0.2760 -0.3035 0.4417 -0.0431 0.0766 -0.2224 -0.2575 -0.0629 -0.0571 -0.0728 -0.0708 -0.1347 -0.1347 0.3358 0.3318 0.0945 0.0985 0.1000 0.0963 0.0841 0.0894 0.0972 0.0986 0.1225 0.1289 0.1428 0.0894 0.0933 0.0944 0.0952 0.0992 0.0905 0.0937 0.1032 0.0939 0.1018 0.0786 0.0802 0.0787 0.0810
va: 2.1015 2.0064 2.0750 2.0676 3.1525 3.7272 3.7061 3.8794 3.8998 3.9057 3.8643 4.1250 3.7487 3.8741 3.9218 3.9427 3.6809 3.7078 3.9184 3.9154 3.9169 3.9158 4.1898 4.1755 1.0240 1.0311 1.0012 1.0007 1.0178 1.0052 1.0016 1.0019 1.0090 1.0154 1.0010 1.0085 0.9956 0.9963 0.9978 0.9960 1.0094 1.0150 1.0047 1.0155 1.0042 1.0067 1.0097 1.0068 1.0093
dispcorr: -0.022844848 hartree
energy: -1094.891185353942
dipole: 14.43792 -15.65022 -1.21230 -22.15736 19.74899 -2.40837 5.78256 -4.83439 0.94817
magnitude: 2.85814 au
magnitude: 7.26480 debye
