program: Orca
programVersion: 5.0.2
elementType: O O O O N C C C C C C C C C C C C C C C C C C C H H H H H H H H H H H H H H H H H H H H H H H H H
charge: 0
multiplicity: 1
keywords: wb97x-d3
keywords: def2-TZVPP
keywords: def2/J RIJCOSX
keywords: DEFGRID2
keywords: scfconv7
keywords: smallprint printgap noloewdin
keywords: NOSOSCF
formula: C19H25NO4
InChI: InChI=1/C19H25NO4/c1-11(2)9-14-15(19(14,3)4)18(23)24-10-20-16(21)12-7-5-6-8-13(12)17(20)22/h9,14-15H,5-8,10H2,1-4H3
49 atoms
O  0.68213 2.153764 0.202932
O  1.047876 2.149148 -2.00497
O  -1.894274 1.14306 -2.194177
O  -1.430292 1.002342 2.323192
N  -1.54823 1.46649 0.069147
C  3.502217 1.049529 0.584883
C  2.540478 -0.077194 0.458712
C  2.577711 1.012585 -0.620975
C  3.319911 2.0534 1.697753
C  4.956991 0.813693 0.250185
C  2.910054 -1.465152 0.107541
C  1.388473 1.828774 -0.888626
C  2.001065 -2.387809 -0.221998
C  -0.662362 2.58831 0.056034
C  2.38773 -3.795908 -0.545878
C  0.534965 -2.055933 -0.288599
C  -2.660719 -0.456219 -0.550834
C  -2.531618 -0.498251 0.775823
C  -3.318094 -1.497383 -1.376325
C  -3.010022 -1.598246 1.647302
C  -4.119667 -2.435117 -0.471903
C  -3.341949 -2.818371 0.786468
C  -2.009323 0.778173 -1.051273
C  -1.787461 0.705745 1.210297
H  1.673066 0.003456 1.108937
H  3.070105 0.728934 -1.54393
H  3.624518 3.052396 1.381265
H  3.953083 1.770897 2.540823
H  2.299585 2.108946 2.067793
H  5.092439 0.14567 -0.599935
H  5.481445 0.380165 1.103679
H  5.447218 1.757781 0.00668
H  3.960594 -1.737993 0.12857
H  -0.81844 3.165306 -0.852347
H  -0.868126 3.22371 0.91252
H  3.463266 -3.955028 -0.471061
H  2.073734 -4.064074 -1.55794
H  1.892432 -4.502128 0.125517
H  0.342686 -1.213633 -0.957756
H  0.139479 -1.77607 0.691362
H  -0.052471 -2.901412 -0.646755
H  -3.959927 -1.039325 -2.132117
H  -2.550273 -2.051196 -1.926924
H  -2.254392 -1.842218 2.39743
H  -3.891688 -1.263586 2.202908
H  -5.05364 -1.944438 -0.184356
H  -4.395293 -3.331104 -1.029013
H  -2.41158 -3.316381 0.49877
H  -3.913256 -3.536179 1.37595
elementType: O N C H
totalener: -1094.86501597 hartree
nucrepener: 2215.89677699 hartree
electener: -3310.76179296 hartree
oneelecener: -5893.47258107 hartree
twoeener: 2582.71078811 hartree
cpcmener: -0.04356682 hartree
kineticenergy: 1090.04402483 hartree
xcener: -105.975232453841 hartree
chargesum: 0.0000000
charge: -0.276554 -0.484578 -0.429640 -0.435316 -0.085491 0.168129 -0.015808 -0.082019 -0.265706 -0.297983 -0.323495 0.386252 0.034685 0.066450 -0.233734 -0.303823 -0.051492 -0.083735 -0.079891 -0.073200 -0.127283 -0.150232 0.313062 0.330186 0.102323 0.090196 0.101070 0.093614 0.088550 0.089934 0.102745 0.100707 0.127323 0.135894 0.131821 0.087268 0.099424 0.100833 0.099920 0.106328 0.104339 0.099878 0.105826 0.097119 0.108790 0.078730 0.081155 0.082401 0.085025
qa: -0.2766 -0.4846 -0.4296 -0.4353 -0.0855 0.1681 -0.0158 -0.0820 -0.2657 -0.2980 -0.3235 0.3863 0.0347 0.0664 -0.2337 -0.3038 -0.0515 -0.0837 -0.0799 -0.0732 -0.1273 -0.1502 0.3131 0.3302 0.1023 0.0902 0.1011 0.0936 0.0886 0.0899 0.1027 0.1007 0.1273 0.1359 0.1318 0.0873 0.0994 0.1008 0.0999 0.1063 0.1043 0.0999 0.1058 0.0971 0.1088 0.0787 0.0812 0.0824 0.0850
va: 2.0920 2.0144 2.0740 2.0671 3.1002 3.7356 3.7765 3.8217 3.8747 3.9207 3.8663 4.1547 3.7002 3.9137 3.9233 3.9698 3.6080 3.6489 3.9152 3.8954 3.9083 3.9146 4.1694 4.1607 1.0204 1.0299 1.0006 1.0004 1.0172 1.0019 0.9985 1.0015 1.0044 1.0178 1.0062 1.0087 0.9930 0.9924 0.9942 0.9936 1.0048 1.0156 1.0034 1.0142 1.0036 1.0068 1.0103 1.0078 1.0120
dispcorr: -0.028320434 hartree
energy: -1094.893336402567
dipole: 11.73266 -12.39241 -0.65975 -20.82425 18.75675 -2.06750 4.49922 -3.19714 1.30207
magnitude: 2.53086 au
magnitude: 6.43293 debye
