program: Orca
programVersion: 5.0.2
elementType: O O O O N C C C C C C C C C C C C C C C C C C C H H H H H H H H H H H H H H H H H H H H H H H H H
charge: 0
multiplicity: 1
keywords: wb97x-d3
keywords: def2-TZVPP
keywords: def2/J RIJCOSX
keywords: DEFGRID2
keywords: scfconv7
keywords: smallprint printgap noloewdin
keywords: NOSOSCF
formula: C19H25NO4
InChI: InChI=1/C19H25NO4/c1-11(2)9-14-15(19(14,3)4)18(23)24-10-20-16(21)12-7-5-6-8-13(12)17(20)22/h9,14-15H,5-8,10H2,1-4H3
49 atoms
O  0.286556 1.391962 -0.780233
O  1.289115 1.873617 1.171819
O  -1.716138 0.582944 1.772822
O  -2.763958 1.461619 -2.558562
N  -2.00991 1.355613 -0.379833
C  3.744488 0.746426 -0.523365
C  3.362393 -0.172715 0.597551
C  2.292704 0.321924 -0.348825
C  4.172036 2.153746 -0.191513
C  4.454291 0.181039 -1.728883
C  3.712407 -1.610619 0.595614
C  1.27068 1.268662 0.126734
C  4.490574 -2.229921 1.488957
C  -0.854243 2.185973 -0.481506
C  4.766538 -3.699352 1.382658
C  5.1583 -1.552541 2.645806
C  -3.458013 -0.289109 0.334282
C  -3.768552 -0.025742 -0.936087
C  -4.1597 -1.270095 1.196879
C  -4.860151 -0.67426 -1.701054
C  -5.484914 -1.667058 0.543905
C  -5.331255 -1.923156 -0.954388
C  -2.305829 0.559842 0.720856
C  -2.830796 1.001698 -1.44629
H  3.351031 0.305148 1.571785
H  1.938696 -0.383689 -1.092634
H  3.907507 2.84256 -0.996279
H  5.256954 2.188148 -0.076306
H  3.737406 2.530521 0.732168
H  4.089227 -0.806149 -2.008905
H  5.524851 0.096056 -1.531949
H  4.32895 0.837859 -2.591332
H  3.29638 -2.204948 -0.213101
H  -0.99376 2.88384 -1.30324
H  -0.725656 2.751207 0.438213
H  4.26073 -4.153705 0.530898
H  4.44504 -4.223969 2.286247
H  5.838106 -3.890234 1.281493
H  4.926608 -0.492453 2.727871
H  6.244388 -1.646728 2.564528
H  4.879933 -2.031567 3.587796
H  -3.518959 -2.146346 1.336862
H  -4.323903 -0.853927 2.193209
H  -5.68348 0.03649 -1.82451
H  -4.522529 -0.923672 -2.70949
H  -5.881486 -2.555296 1.036921
H  -6.215396 -0.868667 0.700951
H  -6.277905 -2.263458 -1.375213
H  -4.609291 -2.729073 -1.112627
elementType: O N C H
totalener: -1094.87000819 hartree
nucrepener: 2058.50066195 hartree
electener: -3153.37067014 hartree
oneelecener: -5579.45233095 hartree
twoeener: 2426.08166081 hartree
cpcmener: -0.04044131 hartree
kineticenergy: 1090.03698872 hartree
xcener: -105.972931033441 hartree
chargesum: 0.0000000
charge: -0.282041 -0.483034 -0.435804 -0.434283 -0.105695 0.129170 0.030924 -0.149850 -0.278585 -0.262674 -0.287977 0.441196 -0.038040 0.079017 -0.222803 -0.252628 -0.060121 -0.074446 -0.073010 -0.071139 -0.134835 -0.134728 0.337871 0.341977 0.091404 0.096304 0.100701 0.097213 0.090038 0.089598 0.097424 0.098508 0.123832 0.128570 0.137291 0.089186 0.094617 0.093643 0.090092 0.096943 0.096137 0.102937 0.094373 0.101581 0.093352 0.081078 0.078035 0.080251 0.078430
qa: -0.2820 -0.4830 -0.4358 -0.4343 -0.1057 0.1292 0.0309 -0.1498 -0.2786 -0.2627 -0.2880 0.4412 -0.0380 0.0790 -0.2228 -0.2526 -0.0601 -0.0744 -0.0730 -0.0711 -0.1348 -0.1347 0.3379 0.3420 0.0914 0.0963 0.1007 0.0972 0.0900 0.0896 0.0974 0.0985 0.1238 0.1286 0.1373 0.0892 0.0946 0.0936 0.0901 0.0969 0.0961 0.1029 0.0944 0.1016 0.0934 0.0811 0.0780 0.0803 0.0784
va: 2.1124 2.0257 2.0746 2.0764 3.1117 3.6905 3.7593 3.8633 3.9076 3.9043 3.8696 4.1491 3.7332 3.8727 3.9219 3.9438 3.6665 3.7030 3.9187 3.9173 3.9159 3.9184 4.1999 4.1954 1.0327 1.0367 0.9996 1.0006 1.0165 1.0039 1.0025 1.0028 1.0077 1.0120 1.0193 1.0083 0.9960 0.9963 1.0086 0.9972 0.9974 1.0047 1.0150 1.0044 1.0157 1.0093 1.0067 1.0095 1.0066
dispcorr: -0.022163672 hartree
energy: -1094.892171861270
dipole: 21.68558 -22.52496 -0.83938 -16.92507 15.38698 -1.53809 3.29036 -4.00652 -0.71616
magnitude: 1.89292 au
magnitude: 4.81143 debye
