program: Orca
programVersion: 5.0.2
elementType: O O O O N C C C C C C C C C C C C C C C C C C C H H H H H H H H H H H H H H H H H H H H H H H H H
charge: 0
multiplicity: 1
keywords: wb97x-d3
keywords: def2-TZVPP
keywords: def2/J RIJCOSX
keywords: DEFGRID2
keywords: scfconv7
keywords: smallprint printgap noloewdin
keywords: NOSOSCF
formula: C19H25NO4
InChI: InChI=1/C19H25NO4/c1-11(2)9-14-15(19(14,3)4)18(23)24-10-20-16(21)12-7-5-6-8-13(12)17(20)22/h9,14-15H,5-8,10H2,1-4H3
49 atoms
O  0.254683 1.695922 0.022365
O  1.385981 1.103452 1.869982
O  -2.997783 2.530129 -1.198532
O  -1.464868 -0.49191 1.82706
N  -1.997785 1.3008 0.479911
C  3.745255 1.120771 -0.252305
C  3.400784 -0.27126 0.181603
C  2.297858 0.653641 -0.294728
C  4.199583 2.105758 0.796464
C  4.396012 1.353302 -1.594333
C  3.734938 -1.465911 -0.617184
C  1.300671 1.150642 0.666105
C  4.219836 -2.622257 -0.151959
C  -0.876125 2.135053 0.764565
C  4.519906 -3.757473 -1.084609
C  4.517066 -2.912205 1.287189
C  -3.793743 0.327642 -0.586868
C  -3.342169 -0.562704 0.297913
C  -4.959262 0.126883 -1.48086
C  -3.934954 -1.900176 0.540511
C  -5.338692 -1.354813 -1.497502
C  -5.324039 -1.96389 -0.096365
C  -2.930836 1.53193 -0.526007
C  -2.165061 0.017012 0.987222
H  3.421012 -0.407273 1.257373
H  1.911708 0.475542 -1.292208
H  3.897868 3.12229 0.536693
H  5.289327 2.094123 0.857439
H  3.818397 1.883251 1.790812
H  4.012385 0.696946 -2.37405
H  5.474382 1.19749 -1.526824
H  4.231392 2.381555 -1.92117
H  3.564016 -1.387416 -1.686918
H  -1.103646 3.149193 0.446168
H  -0.680015 2.139919 1.833814
H  4.299157 -3.508894 -2.122416
H  3.942043 -4.646364 -0.818716
H  5.572539 -4.045832 -1.023055
H  5.576883 -3.146071 1.417497
H  3.965529 -3.794474 1.621403
H  4.275793 -2.094429 1.96302
H  -5.794634 0.736658 -1.122548
H  -4.733888 0.485003 -2.48785
H  -3.278183 -2.66595 0.115731
H  -3.985757 -2.106422 1.61189
H  -6.325506 -1.472898 -1.946246
H  -4.636172 -1.897899 -2.13562
H  -5.659107 -3.000906 -0.135853
H  -6.034968 -1.4281 0.538635
elementType: O N C H
totalener: -1094.87035167 hartree
nucrepener: 2064.59205771 hartree
electener: -3159.46240938 hartree
oneelecener: -5591.68912102 hartree
twoeener: 2432.22671164 hartree
cpcmener: -0.04056425 hartree
kineticenergy: 1090.03647820 hartree
xcener: -105.973769842414 hartree
chargesum: -0.0000000
charge: -0.283386 -0.484642 -0.434109 -0.435617 -0.102426 0.098284 0.039128 -0.113778 -0.272238 -0.272592 -0.283465 0.434817 -0.051708 0.080367 -0.217973 -0.250450 -0.077574 -0.058126 -0.071007 -0.075362 -0.136214 -0.134172 0.342115 0.337178 0.092320 0.095346 0.100273 0.097730 0.090884 0.090294 0.098421 0.098656 0.122279 0.127668 0.138466 0.089002 0.093990 0.093333 0.096818 0.095858 0.089981 0.102102 0.093428 0.103106 0.094209 0.080929 0.078621 0.080770 0.078469
qa: -0.2834 -0.4846 -0.4341 -0.4356 -0.1024 0.0983 0.0391 -0.1138 -0.2722 -0.2726 -0.2835 0.4348 -0.0517 0.0804 -0.2180 -0.2504 -0.0776 -0.0581 -0.0710 -0.0754 -0.1362 -0.1342 0.3421 0.3372 0.0923 0.0953 0.1003 0.0977 0.0909 0.0903 0.0984 0.0987 0.1223 0.1277 0.1385 0.0890 0.0940 0.0933 0.0968 0.0959 0.0900 0.1021 0.0934 0.1031 0.0942 0.0809 0.0786 0.0808 0.0785
va: 2.1111 2.0234 2.0773 2.0748 3.1079 3.7035 3.7693 3.8087 3.9055 3.9107 3.8737 4.1566 3.7666 3.8691 3.9189 3.9401 3.7033 3.6664 3.9169 3.9196 3.9184 3.9156 4.1975 4.2005 1.0325 1.0345 0.9996 0.9999 1.0168 1.0061 1.0013 1.0015 1.0102 1.0134 1.0182 1.0086 0.9964 0.9960 0.9968 0.9968 1.0104 1.0043 1.0156 1.0045 1.0152 1.0092 1.0065 1.0094 1.0067
dispcorr: -0.021997707 hartree
energy: -1094.892349375226
dipole: 20.22878 -21.17838 -0.94960 -16.28883 15.25230 -1.03653 -6.75343 5.42095 -1.33248
magnitude: 1.93691 au
magnitude: 4.92325 debye
