program: Orca
programVersion: 5.0.2
elementType: O O O O N C C C C C C C C C C C C C C C C C C C H H H H H H H H H H H H H H H H H H H H H H H H H
charge: 0
multiplicity: 1
keywords: wb97x-d3
keywords: def2-TZVPP
keywords: def2/J RIJCOSX
keywords: DEFGRID2
keywords: scfconv7
keywords: smallprint printgap noloewdin
keywords: NOSOSCF
formula: C19H25NO4
InChI: InChI=1/C19H25NO4/c1-11(2)9-14-15(19(14,3)4)18(23)24-10-20-16(21)12-7-5-6-8-13(12)17(20)22/h9,14-15H,5-8,10H2,1-4H3
49 atoms
O  0.514404 1.800281 -1.40409
O  0.385212 -0.423812 -1.615968
O  -1.507966 2.675274 0.693731
O  -2.517594 -0.307423 -2.586069
N  -1.808153 1.40833 -1.208593
C  2.236543 0.150454 0.993647
C  2.89106 -0.717409 -0.047404
C  2.239385 0.569601 -0.468053
C  0.957872 -0.328306 1.635466
C  3.101449 0.964803 1.921277
C  4.363985 -0.849608 -0.150708
C  0.975078 0.555001 -1.225497
C  5.070246 -1.938506 0.167437
C  -0.763019 1.974176 -2.004463
C  6.559886 -1.971052 0.007018
C  4.469583 -3.198786 0.708961
C  -2.943242 0.726435 0.679735
C  -3.225791 -0.155582 -0.279762
C  -3.480396 0.689556 2.060747
C  -4.115152 -1.331102 -0.121548
C  -4.656538 -0.286189 2.124385
C  -4.36768 -1.581001 1.366601
C  -2.013315 1.73808 0.126655
C  -2.501832 0.238553 -1.512136
H  2.325301 -1.611505 -0.291096
H  2.891591 1.406625 -0.696885
H  0.334954 0.514229 1.945117
H  1.189379 -0.907965 2.531096
H  0.362607 -0.966794 0.984083
H  3.411936 0.363522 2.778356
H  2.54921 1.824812 2.304305
H  4.002024 1.338348 1.435279
H  4.903341 0.019452 -0.516959
H  -0.804275 1.538336 -3.001907
H  -0.886039 3.050486 -2.087811
H  7.05283 -2.147484 0.966624
H  6.950808 -1.042129 -0.407656
H  6.865194 -2.78948 -0.649855
H  4.699478 -4.048757 0.061285
H  3.388569 -3.149616 0.827962
H  4.900104 -3.433115 1.686197
H  -2.683269 0.383104 2.745835
H  -3.783808 1.689442 2.378785
H  -5.056096 -1.14531 -0.648924
H  -3.671855 -2.209866 -0.59499
H  -4.89081 -0.507108 3.166269
H  -5.54259 0.191976 1.697766
H  -5.200338 -2.275576 1.482283
H  -3.490321 -2.066967 1.80242
elementType: O N C H
totalener: -1094.86844786 hartree
nucrepener: 2147.25338455 hartree
electener: -3242.12183241 hartree
oneelecener: -5757.04634649 hartree
twoeener: 2514.92451408 hartree
cpcmener: -0.04001847 hartree
kineticenergy: 1090.04532022 hartree
xcener: -105.974554217533 hartree
chargesum: -0.0000000
charge: -0.277280 -0.471917 -0.433698 -0.427589 -0.105189 0.165451 -0.005247 -0.140531 -0.293125 -0.268763 -0.282857 0.409665 -0.032824 0.084475 -0.227391 -0.252899 -0.101529 -0.020035 -0.063941 -0.072866 -0.137702 -0.135271 0.327101 0.309294 0.096383 0.102326 0.093297 0.105314 0.091385 0.096924 0.099452 0.091943 0.123572 0.136059 0.144997 0.094514 0.089414 0.094526 0.097582 0.089213 0.096678 0.101857 0.094394 0.101637 0.093548 0.080903 0.078624 0.081023 0.079104
qa: -0.2773 -0.4719 -0.4337 -0.4276 -0.1052 0.1655 -0.0052 -0.1405 -0.2931 -0.2688 -0.2829 0.4097 -0.0328 0.0845 -0.2274 -0.2529 -0.1015 -0.0200 -0.0639 -0.0729 -0.1377 -0.1353 0.3271 0.3093 0.0964 0.1023 0.0933 0.1053 0.0914 0.0969 0.0995 0.0919 0.1236 0.1361 0.1450 0.0945 0.0894 0.0945 0.0976 0.0892 0.0967 0.1019 0.0944 0.1016 0.0935 0.0809 0.0786 0.0810 0.0791
va: 2.1128 2.0346 2.0669 2.0801 3.0806 3.6743 3.7974 3.8637 3.9016 3.8971 3.8674 4.2021 3.7108 3.8907 3.9246 3.9431 3.7152 3.6097 3.9122 3.9099 3.9205 3.9152 4.1572 4.1955 1.0258 1.0333 1.0082 1.0024 1.0124 1.0025 1.0030 1.0019 1.0071 1.0135 0.9931 0.9962 1.0081 0.9955 0.9977 1.0083 0.9972 1.0062 1.0159 1.0039 1.0156 1.0094 1.0060 1.0093 1.0072
dispcorr: -0.025385639 hartree
energy: -1094.893833501657
dipole: 18.37557 -18.70682 -0.33125 -15.38861 15.16691 -0.22170 18.84441 -17.14714 1.69728
magnitude: 1.74345 au
magnitude: 4.43151 debye
