program: Orca
programVersion: 5.0.2
elementType: O O O O N C C C C C C C C C C C C C C C C C C C H H H H H H H H H H H H H H H H H H H H H H H H H
charge: 0
multiplicity: 1
keywords: wb97x-d3
keywords: def2-TZVPP
keywords: def2/J RIJCOSX
keywords: DEFGRID2
keywords: scfconv7
keywords: smallprint printgap noloewdin
keywords: NOSOSCF
formula: C19H25NO4
InChI: InChI=1/C19H25NO4/c1-11(2)9-14-15(19(14,3)4)18(23)24-10-20-16(21)12-7-5-6-8-13(12)17(20)22/h9,14-15H,5-8,10H2,1-4H3
49 atoms
O  0.359787 1.131576 0.025251
O  1.501002 0.762981 -1.869954
O  -2.890195 2.693897 1.062285
O  -1.553702 -0.805591 -1.505481
N  -1.922557 1.154414 -0.357936
C  2.607191 -1.651162 -0.198791
C  3.63331 -0.570066 -0.297574
C  2.229504 -0.225991 0.179137
C  2.079348 -2.272688 -1.469353
C  2.652075 -2.630315 0.949454
C  4.779628 -0.455689 0.62835
C  1.360132 0.588121 -0.684839
C  5.808991 0.387079 0.495483
C  -0.688409 1.804036 -0.658501
C  6.93653 0.388218 1.482578
C  5.948598 1.386452 -0.612334
C  -3.94594 0.570646 0.569725
C  -3.552345 -0.461256 -0.178289
C  -5.220298 0.638391 1.325819
C  -4.304886 -1.727008 -0.352203
C  -6.151176 -0.479446 0.852018
C  -5.412678 -1.807874 0.699659
C  -2.904574 1.627644 0.503468
C  -2.241381 -0.126091 -0.786385
H  3.826941 -0.242662 -1.313686
H  2.103254 -0.056734 1.242538
H  2.648864 -3.176742 -1.695604
H  2.155673 -1.618868 -2.335043
H  1.03311 -2.565545 -1.358172
H  3.377388 -3.422683 0.752117
H  1.676364 -3.102184 1.080231
H  2.915035 -2.165837 1.899233
H  4.783942 -1.121809 1.485729
H  -0.519042 1.814367 -1.733372
H  -0.737309 2.829553 -0.297651
H  7.014388 1.353967 1.989404
H  7.895764 0.226206 0.982876
H  6.822019 -0.383208 2.244238
H  6.199843 2.369803 -0.207549
H  5.049811 1.50162 -1.215051
H  6.768129 1.11309 -1.282665
H  -5.013126 0.543665 2.396696
H  -5.6876 1.617565 1.196524
H  -4.724166 -1.763749 -1.362943
H  -3.629972 -2.583156 -0.276665
H  -6.978648 -0.588001 1.55463
H  -6.591724 -0.197513 -0.10857
H  -6.113897 -2.599457 0.431694
H  -4.975067 -2.090264 1.661476
elementType: O N C H
totalener: -1094.87883556 hartree
nucrepener: 2068.80449438 hartree
electener: -3163.68332995 hartree
oneelecener: -5600.03022856 hartree
twoeener: 2436.34689861 hartree
cpcmener: -0.03048268 hartree
kineticenergy: 1090.04544455 hartree
xcener: -105.972869818469 hartree
chargesum: 0.0000000
charge: -0.285477 -0.459434 -0.409616 -0.415054 -0.092386 0.126336 -0.029203 -0.056942 -0.274894 -0.294352 -0.260301 0.385873 -0.020671 0.079639 -0.229667 -0.260489 -0.082508 -0.058435 -0.072503 -0.071187 -0.135314 -0.136000 0.323310 0.314759 0.100447 0.092707 0.097488 0.096029 0.092379 0.103598 0.098757 0.088799 0.117608 0.142275 0.123690 0.094252 0.092641 0.087870 0.092652 0.087300 0.099812 0.100813 0.092831 0.100337 0.093525 0.081277 0.078194 0.080820 0.078415
qa: -0.2855 -0.4594 -0.4096 -0.4151 -0.0924 0.1263 -0.0292 -0.0569 -0.2749 -0.2944 -0.2603 0.3859 -0.0207 0.0796 -0.2297 -0.2605 -0.0825 -0.0584 -0.0725 -0.0712 -0.1353 -0.1360 0.3233 0.3148 0.1004 0.0927 0.0975 0.0960 0.0924 0.1036 0.0988 0.0888 0.1176 0.1423 0.1237 0.0943 0.0926 0.0879 0.0927 0.0873 0.0998 0.1008 0.0928 0.1003 0.0935 0.0813 0.0782 0.0808 0.0784
va: 2.1071 2.0484 2.1102 2.0984 3.0915 3.7472 3.8303 3.7882 3.8874 3.9180 3.9026 4.1806 3.7257 3.8555 3.9303 3.9437 3.6978 3.6604 3.9200 3.9186 3.9118 3.9139 4.2246 4.2158 1.0208 1.0323 1.0014 1.0171 1.0069 0.9990 1.0015 1.0040 1.0092 1.0161 1.0162 0.9961 0.9952 1.0083 0.9981 1.0128 0.9959 1.0053 1.0158 1.0052 1.0157 1.0094 1.0069 1.0095 1.0068
dispcorr: -0.022588812 hartree
energy: -1094.901424375556
dipole: 18.44113 -19.67211 -1.23098 -13.50429 12.54558 -0.95871 5.79774 -4.64345 1.15429
magnitude: 1.94083 au
magnitude: 4.93321 debye
