program: Orca
programVersion: 5.0.2
elementType: O O O O N C C C C C C C C C C C C C C C C C C C H H H H H H H H H H H H H H H H H H H H H H H H H
charge: 0
multiplicity: 1
keywords: wb97x-d3
keywords: def2-TZVPP
keywords: def2/J RIJCOSX
keywords: DEFGRID2
keywords: scfconv7
keywords: smallprint printgap noloewdin
keywords: NOSOSCF
formula: C19H25NO4
InChI: InChI=1/C19H25NO4/c1-11(2)9-14-15(19(14,3)4)18(23)24-10-20-16(21)12-7-5-6-8-13(12)17(20)22/h9,14-15H,5-8,10H2,1-4H3
49 atoms
O  0.495824 1.621047 -1.217198
O  0.623546 1.351107 0.998375
O  -2.400647 2.147093 1.352104
O  -1.766056 -0.108351 -2.543811
N  -1.789626 1.266162 -0.69678
C  3.691195 1.118203 0.410949
C  3.126147 -0.260933 0.55118
C  2.46622 0.724038 -0.399059
C  3.573979 2.059527 1.584716
C  4.956309 1.334684 -0.384407
C  3.798064 -1.453286 0.000878
C  1.126147 1.251005 -0.093706
C  3.9827 -2.622774 0.622529
C  -0.794849 2.202736 -1.110477
C  4.704089 -3.74626 -0.060032
C  3.521852 -2.940467 2.011911
C  -3.383705 0.112043 0.497491
C  -3.20043 -0.553001 -0.643315
C  -4.339192 -0.270324 1.565146
C  -3.90227 -1.802149 -1.025371
C  -5.305265 -1.329896 1.031541
C  -4.58584 -2.396497 0.207199
C  -2.489982 1.29752 0.505207
C  -2.185123 0.168733 -1.449066
H  2.573558 -0.412932 1.47187
H  2.655646 0.564985 -1.454861
H  4.480749 1.994642 2.19009
H  2.734296 1.832894 2.237389
H  3.475794 3.095919 1.253847
H  5.006256 0.725471 -1.286111
H  5.834332 1.101972 0.221963
H  5.035758 2.379066 -0.692479
H  4.184564 -1.357327 -1.009653
H  -1.015641 2.569177 -2.110352
H  -0.799432 3.045054 -0.418921
H  5.586111 -4.050299 0.510232
H  5.03092 -3.47923 -1.06519
H  4.068078 -4.632362 -0.137654
H  2.979293 -2.131684 2.497151
H  4.3736 -3.192964 2.648921
H  2.871438 -3.819037 2.008424
H  -3.782832 -0.649841 2.428385
H  -4.881733 0.608401 1.92247
H  -4.635324 -1.58183 -1.808081
H  -3.199028 -2.514166 -1.464112
H  -5.834769 -1.793918 1.864978
H  -6.064488 -0.845463 0.410768
H  -5.291164 -3.168664 -0.103059
H  -3.835157 -2.890524 0.830805
elementType: O N C H
totalener: -1094.88026054 hartree
nucrepener: 2091.51588202 hartree
electener: -3186.39614255 hartree
oneelecener: -5645.70561899 hartree
twoeener: 2459.30947644 hartree
cpcmener: -0.03313814 hartree
kineticenergy: 1090.04641060 hartree
xcener: -105.973139165847 hartree
chargesum: -0.0000000
charge: -0.283776 -0.463706 -0.403027 -0.410580 -0.100135 0.102104 0.042386 -0.115643 -0.276053 -0.270192 -0.271669 0.418495 -0.049660 0.085425 -0.217012 -0.251065 -0.069100 -0.086281 -0.073274 -0.075574 -0.136873 -0.134623 0.321778 0.316736 0.094594 0.086695 0.094702 0.093629 0.097976 0.088029 0.097452 0.097606 0.116756 0.144566 0.131482 0.092759 0.087433 0.092749 0.089202 0.095721 0.094890 0.101532 0.093181 0.100306 0.093140 0.080755 0.077678 0.080148 0.078338
qa: -0.2838 -0.4637 -0.4030 -0.4106 -0.1001 0.1021 0.0424 -0.1156 -0.2761 -0.2702 -0.2717 0.4185 -0.0497 0.0854 -0.2170 -0.2511 -0.0691 -0.0863 -0.0733 -0.0756 -0.1369 -0.1346 0.3218 0.3167 0.0946 0.0867 0.0947 0.0936 0.0980 0.0880 0.0975 0.0976 0.1168 0.1446 0.1315 0.0928 0.0874 0.0927 0.0892 0.0957 0.0949 0.1015 0.0932 0.1003 0.0931 0.0808 0.0777 0.0801 0.0783
va: 2.1160 2.0483 2.1137 2.1073 3.0760 3.6890 3.7745 3.8376 3.9041 3.9141 3.8769 4.1593 3.7674 3.8848 3.9202 3.9408 3.6512 3.6881 3.9194 3.9226 3.9146 3.9140 4.2166 4.2193 1.0301 1.0372 0.9999 1.0199 0.9996 1.0067 1.0018 1.0017 1.0115 0.9937 1.0175 0.9960 1.0091 0.9965 1.0111 0.9971 0.9969 1.0047 1.0160 1.0047 1.0156 1.0093 1.0067 1.0094 1.0068
dispcorr: -0.022439237 hartree
energy: -1094.902699772326
dipole: 19.80343 -20.14049 -0.33706 -16.93077 15.80185 -1.12892 8.49750 -8.65793 -0.16043
magnitude: 1.18904 au
magnitude: 3.02230 debye
