program: Orca
programVersion: 5.0.2
elementType: O O O O N C C C C C C C C C C C C C C C C C C C H H H H H H H H H H H H H H H H H H H H H H H H H
charge: 0
multiplicity: 1
keywords: wb97x-d3
keywords: def2-TZVPP
keywords: def2/J RIJCOSX
keywords: DEFGRID2
keywords: scfconv7
keywords: smallprint printgap noloewdin
keywords: NOSOSCF
formula: C19H25NO4
InChI: InChI=1/C19H25NO4/c1-11(2)9-14-15(19(14,3)4)18(23)24-10-20-16(21)12-7-5-6-8-13(12)17(20)22/h9,14-15H,5-8,10H2,1-4H3
49 atoms
O  0.517448 1.865399 -1.097657
O  0.662003 1.493702 1.10236
O  -1.640072 0.09493 -2.488186
O  -2.389526 2.159879 1.491933
N  -1.746778 1.400671 -0.593915
C  3.703509 1.051602 0.522684
C  3.030035 -0.283028 0.454929
C  2.471817 0.886131 -0.348134
C  3.637945 1.821046 1.819669
C  4.999167 1.274392 -0.220801
C  3.586243 -1.434239 -0.280735
C  1.153476 1.436361 0.00206
C  3.585612 -2.712129 0.112977
C  -0.79163 2.396578 -0.961334
C  4.155803 -3.782659 -0.769055
C  3.034163 -3.210421 1.41371
C  -3.028719 -0.513068 -0.597602
C  -3.245614 0.095501 0.568824
C  -3.64437 -1.795701 -1.018262
C  -4.16017 -0.39153 1.630273
C  -4.267575 -2.48194 0.198775
C  -5.052554 -1.500924 1.068827
C  -2.072075 0.305433 -1.383671
C  -2.434674 1.338885 0.61396
H  2.444834 -0.522586 1.336361
H  2.671336 0.856429 -1.413506
H  3.6193 2.897908 1.639406
H  4.529281 1.604898 2.412181
H  2.774145 1.567789 2.429442
H  5.015468 0.805803 -1.203869
H  5.840457 0.877456 0.351261
H  5.17403 2.342243 -0.366614
H  4.019487 -1.210183 -1.251337
H  -1.0286 2.804062 -1.941265
H  -0.827135 3.202397 -0.228334
H  4.978306 -4.306228 -0.274176
H  4.529621 -3.385404 -1.712745
H  3.40278 -4.541414 -0.999178
H  3.790188 -3.786939 1.952534
H  2.19549 -3.891077 1.242741
H  2.688684 -2.422942 2.080342
H  -4.401587 -1.601054 -1.784667
H  -2.897517 -2.438858 -1.489787
H  -3.568519 -0.758185 2.475418
H  -4.761184 0.432628 2.02228
H  -4.918859 -3.292232 -0.132419
H  -3.474826 -2.941683 0.796256
H  -5.534565 -2.032137 1.890685
H  -5.853574 -1.052959 0.473928
elementType: O N C H
totalener: -1094.87991307 hartree
nucrepener: 2107.23167052 hartree
electener: -3202.11158359 hartree
oneelecener: -5677.10537399 hartree
twoeener: 2474.99379040 hartree
cpcmener: -0.03312677 hartree
kineticenergy: 1090.03848090 hartree
xcener: -105.971436118541 hartree
chargesum: -0.0000000
charge: -0.283945 -0.463559 -0.409705 -0.402942 -0.102433 0.105700 0.041362 -0.107057 -0.276641 -0.269787 -0.273319 0.410107 -0.049964 0.087810 -0.216210 -0.252813 -0.082454 -0.068468 -0.075351 -0.074596 -0.135256 -0.136751 0.313069 0.320576 0.097498 0.086496 0.097834 0.094125 0.093654 0.088135 0.097505 0.096545 0.116094 0.143579 0.130927 0.092704 0.087469 0.092454 0.094279 0.097320 0.089462 0.100403 0.093572 0.101586 0.093708 0.080477 0.078351 0.080604 0.077849
qa: -0.2839 -0.4636 -0.4097 -0.4029 -0.1024 0.1057 0.0414 -0.1071 -0.2766 -0.2698 -0.2733 0.4101 -0.0500 0.0878 -0.2162 -0.2528 -0.0825 -0.0685 -0.0754 -0.0746 -0.1353 -0.1368 0.3131 0.3206 0.0975 0.0865 0.0978 0.0941 0.0937 0.0881 0.0975 0.0965 0.1161 0.1436 0.1309 0.0927 0.0875 0.0925 0.0943 0.0973 0.0895 0.1004 0.0936 0.1016 0.0937 0.0805 0.0784 0.0806 0.0778
va: 2.1157 2.0477 2.1077 2.1140 3.0759 3.6884 3.7775 3.8290 3.9006 3.9139 3.8824 4.1591 3.7676 3.8866 3.9203 3.9411 3.6862 3.6540 3.9215 3.9190 3.9137 3.9154 4.2190 4.2154 1.0283 1.0378 0.9997 0.9999 1.0205 1.0064 1.0015 1.0018 1.0122 0.9933 1.0174 0.9966 1.0092 0.9961 0.9975 0.9964 1.0107 1.0047 1.0156 1.0048 1.0159 1.0094 1.0069 1.0093 1.0065
dispcorr: -0.022587664 hartree
energy: -1094.902500732316
dipole: 18.63380 -18.97382 -0.34002 -19.30243 17.98635 -1.31608 6.48589 -6.72800 -0.24211
magnitude: 1.38069 au
magnitude: 3.50943 debye
