program: Orca
programVersion: 5.0.2
elementType: O O O O N C C C C C C C C C C C C C C C C C C C H H H H H H H H H H H H H H H H H H H H H H H H H
charge: 0
multiplicity: 1
keywords: wb97x-d3
keywords: def2-TZVPP
keywords: def2/J RIJCOSX
keywords: DEFGRID2
keywords: scfconv7
keywords: smallprint printgap noloewdin
keywords: NOSOSCF
formula: C19H25NO4
InChI: InChI=1/C19H25NO4/c1-11(2)9-14-15(19(14,3)4)18(23)24-10-20-16(21)12-7-5-6-8-13(12)17(20)22/h9,14-15H,5-8,10H2,1-4H3
49 atoms
O  0.442388 1.709377 -0.149091
O  1.591162 1.631558 1.777928
O  -3.057107 2.269306 -1.299336
O  -1.007136 -0.478355 1.681391
N  -1.779829 1.180621 0.284783
C  4.033854 1.240034 -0.164442
C  3.624109 -0.063827 0.423273
C  2.573864 0.810183 -0.240713
C  4.461432 2.359343 0.751878
C  4.7599 1.248338 -1.488205
C  4.004752 -1.36653 -0.182101
C  1.525087 1.417902 0.592502
C  3.235685 -2.458114 -0.198915
C  -0.746574 2.142831 0.495079
C  3.71429 -3.738462 -0.811757
C  1.853034 -2.500367 0.375694
C  -3.607593 0.04099 -0.52941
C  -3.007064 -0.767949 0.34428
C  -4.841586 -0.284076 -1.285435
C  -3.477677 -2.124922 0.71536
C  -5.127659 -1.783593 -1.178718
C  -4.921264 -2.30778 0.242827
C  -2.834861 1.306747 -0.61166
C  -1.813056 -0.071588 0.883549
H  3.556976 -0.062546 1.508976
H  2.241409 0.498641 -1.22447
H  4.218716 3.334294 0.32375
H  5.54444 2.323781 0.888062
H  4.009827 2.30319 1.73975
H  4.618882 2.204094 -1.996724
H  4.414972 0.464108 -2.162273
H  5.833133 1.110725 -1.340095
H  4.999603 -1.428211 -0.61534
H  -1.052814 3.083514 0.042096
H  -0.589434 2.298454 1.560319
H  4.715161 -3.644615 -1.233362
H  3.041988 -4.067939 -1.608508
H  3.733597 -4.544146 -0.073014
H  1.111745 -2.6742 -0.409424
H  1.57724 -1.58785 0.899857
H  1.754331 -3.330326 1.080104
H  -5.674917 0.299587 -0.880477
H  -4.741883 0.021214 -2.330042
H  -2.821151 -2.872196 0.257145
H  -3.39623 -2.27532 1.794657
H  -6.148594 -1.983873 -1.506272
H  -4.468524 -2.325189 -1.86299
H  -5.192808 -3.362911 0.295809
H  -5.592241 -1.777893 0.925039
elementType: O N C H
totalener: -1094.87832115 hartree
nucrepener: 2109.42618688 hartree
electener: -3204.30450803 hartree
oneelecener: -5681.23880002 hartree
twoeener: 2476.93429199 hartree
cpcmener: -0.03051581 hartree
kineticenergy: 1090.03315217 hartree
xcener: -105.969712684016 hartree
chargesum: -0.0000000
charge: -0.284366 -0.459049 -0.409266 -0.414925 -0.091476 0.153115 -0.012115 -0.116273 -0.279184 -0.285599 -0.300094 0.393690 -0.008697 0.078907 -0.229355 -0.232760 -0.083741 -0.058552 -0.071837 -0.073767 -0.137097 -0.134697 0.322139 0.318550 0.104042 0.093419 0.098752 0.094051 0.093571 0.097639 0.093162 0.098628 0.121928 0.124193 0.140223 0.089025 0.093814 0.095913 0.099004 0.071404 0.100429 0.100923 0.093768 0.101292 0.092970 0.081020 0.078264 0.080648 0.078367
qa: -0.2844 -0.4590 -0.4093 -0.4149 -0.0915 0.1531 -0.0121 -0.1163 -0.2792 -0.2856 -0.3001 0.3937 -0.0087 0.0789 -0.2294 -0.2328 -0.0837 -0.0586 -0.0718 -0.0738 -0.1371 -0.1347 0.3221 0.3185 0.1040 0.0934 0.0988 0.0941 0.0936 0.0976 0.0932 0.0986 0.1219 0.1242 0.1402 0.0890 0.0938 0.0959 0.0990 0.0714 0.1004 0.1009 0.0938 0.1013 0.0930 0.0810 0.0783 0.0806 0.0784
va: 2.1035 2.0485 2.1106 2.0955 3.0976 3.6960 3.8117 3.8020 3.8938 3.9100 3.8965 4.1596 3.7123 3.8579 3.9315 3.9425 3.6957 3.6687 3.9179 3.9229 3.9169 3.9141 4.2249 4.2015 1.0266 1.0322 0.9992 1.0011 1.0180 1.0032 1.0017 0.9997 1.0036 1.0164 1.0166 1.0063 0.9964 0.9963 0.9982 1.0151 1.0011 1.0048 1.0154 1.0049 1.0160 1.0094 1.0065 1.0097 1.0068
dispcorr: -0.023851108 hartree
energy: -1094.902172261721
dipole: 14.73010 -15.85217 -1.12207 -16.63151 15.21494 -1.41657 -6.08057 4.96198 -1.11859
magnitude: 2.12531 au
magnitude: 5.40212 debye
