program: Orca
programVersion: 5.0.2
elementType: O O O O N C C C C C C C C C C C C C C C C C C C H H H H H H H H H H H H H H H H H H H H H H H H H
charge: 0
multiplicity: 1
keywords: wb97x-d3
keywords: def2-TZVPP
keywords: def2/J RIJCOSX
keywords: DEFGRID2
keywords: scfconv7
keywords: smallprint printgap noloewdin
keywords: NOSOSCF
formula: C19H25NO4
InChI: InChI=1/C19H25NO4/c1-11(2)9-14-15(19(14,3)4)18(23)24-10-20-16(21)12-7-5-6-8-13(12)17(20)22/h9,14-15H,5-8,10H2,1-4H3
49 atoms
O  0.613568 1.041379 -1.125489
O  1.499835 2.917359 -0.278236
O  -2.573663 -0.288381 -2.348832
O  -1.30809 2.128051 1.283272
N  -1.686575 1.125726 -0.755612
C  2.501552 -0.272957 0.97532
C  2.954945 -0.518656 -0.434114
C  2.673907 0.894879 0.014181
C  1.126949 -0.73801 1.390519
C  3.512548 -0.352202 2.092226
C  4.355495 -0.891537 -0.756513
C  1.5520 1.72572 -0.459833
C  4.779688 -2.122792 -1.053471
C  -0.598982 1.689093 -1.486377
C  6.217218 -2.390536 -1.381223
C  3.888605 -3.325969 -1.082115
C  -3.484364 -0.160926 -0.109832
C  -3.119328 0.55418 0.955044
C  -4.617373 -1.117291 -0.148545
C  -3.795824 0.527685 2.274533
C  -5.091778 -1.408189 1.277092
C  -5.1636 -0.141476 2.128558
C  -2.571367 0.16601 -1.234334
C  -1.943835 1.38026 0.585792
H  2.197051 -0.962181 -1.07215
H  3.548272 1.503922 0.2194
H  0.692509 -0.07063 2.137685
H  1.2012 -1.728613 1.84437
H  0.428873 -0.819377 0.559961
H  4.488065 0.04043 1.806956
H  3.653433 -1.388701 2.406602
H  3.170449 0.212714 2.96174
H  5.086354 -0.087566 -0.745822
H  -0.763771 1.513222 -2.546911
H  -0.545504 2.761032 -1.309307
H  6.823382 -1.485147 -1.348737
H  6.318838 -2.827434 -2.378373
H  6.651582 -3.111884 -0.683711
H  3.879614 -3.782171 -2.075005
H  2.859004 -3.109342 -0.804334
H  4.259961 -4.092087 -0.397402
H  -5.427808 -0.690143 -0.747808
H  -4.322708 -2.03799 -0.657497
H  -3.171385 -0.014905 2.991709
H  -3.896421 1.540806 2.670394
H  -6.068648 -1.892397 1.244128
H  -4.406093 -2.119594 1.745791
H  -5.562839 -0.376607 3.116085
H  -5.861024 0.564999 1.669884
elementType: O N C H
totalener: -1094.87723301 hartree
nucrepener: 2113.81410389 hartree
electener: -3208.69133690 hartree
oneelecener: -5689.52532546 hartree
twoeener: 2480.83398856 hartree
cpcmener: -0.03323351 hartree
kineticenergy: 1090.04348166 hartree
xcener: -105.971970370890 hartree
chargesum: 0.0000000
charge: -0.275521 -0.451935 -0.408406 -0.402536 -0.075042 0.150912 0.036689 -0.158666 -0.302350 -0.268049 -0.287192 0.417966 -0.028986 0.058977 -0.228770 -0.251721 -0.088908 -0.022556 -0.070252 -0.074312 -0.136916 -0.135026 0.323423 0.257572 0.104595 0.091111 0.101698 0.099504 0.085179 0.090822 0.094323 0.099962 0.119209 0.125808 0.142512 0.089104 0.094172 0.093542 0.098962 0.086758 0.095231 0.100765 0.093958 0.101365 0.094531 0.080396 0.078426 0.081322 0.078351
qa: -0.2755 -0.4519 -0.4084 -0.4025 -0.0750 0.1509 0.0367 -0.1587 -0.3024 -0.2680 -0.2872 0.4180 -0.0290 0.0590 -0.2288 -0.2517 -0.0889 -0.0226 -0.0703 -0.0743 -0.1369 -0.1350 0.3234 0.2576 0.1046 0.0911 0.1017 0.0995 0.0852 0.0908 0.0943 0.1000 0.1192 0.1258 0.1425 0.0891 0.0942 0.0935 0.0990 0.0868 0.0952 0.1008 0.0940 0.1014 0.0945 0.0804 0.0784 0.0813 0.0784
va: 2.1011 2.0568 2.1111 2.1069 3.0839 3.6654 3.7387 3.9061 3.9095 3.9042 3.8616 4.1921 3.7083 3.8738 3.9278 3.9440 3.7120 3.6174 3.9192 3.9204 3.9166 3.9144 4.2000 4.2231 1.0183 1.0347 1.0052 1.0026 1.0127 1.0033 1.0029 1.0022 1.0083 1.0150 1.0173 1.0079 0.9954 0.9964 0.9979 1.0083 0.9977 1.0051 1.0154 1.0053 1.0158 1.0096 1.0065 1.0096 1.0068
dispcorr: -0.024582192 hartree
energy: -1094.901815198718
dipole: 14.14233 -15.38848 -1.24616 -21.53222 19.46230 -2.06992 9.68376 -8.93920 0.74455
magnitude: 2.52821 au
magnitude: 6.42619 debye
