program: Orca
programVersion: 5.0.2
elementType: O O O O N C C C C C C C C C C C C C C C C C C C H H H H H H H H H H H H H H H H H H H H H H H H H
charge: 0
multiplicity: 1
keywords: wb97x-d3
keywords: def2-TZVPP
keywords: def2/J RIJCOSX
keywords: DEFGRID2
keywords: scfconv7
keywords: smallprint printgap noloewdin
keywords: NOSOSCF
formula: C19H25NO4
InChI: InChI=1/C19H25NO4/c1-11(2)9-14-15(19(14,3)4)18(23)24-10-20-16(21)12-7-5-6-8-13(12)17(20)22/h9,14-15H,5-8,10H2,1-4H3
49 atoms
O  0.328814 0.58663 0.515605
O  1.852551 1.067052 2.070148
O  -2.54554 2.507937 0.113515
O  -1.919868 -1.876598 1.125859
N  -1.93155 0.411794 0.853651
C  3.702829 1.501692 -0.443444
C  3.975144 0.169016 0.16183
C  2.540723 0.557489 -0.169386
C  3.909422 2.739393 0.394775
C  4.002553 1.727049 -1.906091
C  4.64306 -0.934495 -0.571517
C  1.585083 0.772722 0.92823
C  4.631856 -2.215644 -0.193377
C  -0.703089 0.725616 1.49136
C  5.379539 -3.261718 -0.961965
C  3.893549 -2.712646 1.011027
C  -3.857772 0.539193 -0.400509
C  -3.675556 -0.748187 -0.102769
C  -4.988769 1.079388 -1.193045
C  -4.580376 -1.853507 -0.501055
C  -5.704869 -0.068509 -1.907005
C  -5.909001 -1.274379 -0.990919
C  -2.741222 1.322567 0.184166
C  -2.42837 -0.876817 0.68989
H  4.184079 0.20105 1.227905
H  2.111863 0.097882 -1.052558
H  3.226802 3.537182 0.094928
H  4.926983 3.108886 0.251218
H  3.777506 2.565044 1.460241
H  3.397348 2.547961 -2.295548
H  3.796632 0.85095 -2.520926
H  5.051453 1.995883 -2.048987
H  5.20233 -0.667106 -1.463411
H  -0.743091 1.746509 1.870755
H  -0.541589 0.042816 2.325296
H  4.702665 -4.033142 -1.338971
H  6.10501 -3.773908 -0.324019
H  5.918575 -2.842431 -1.811711
H  3.248591 -1.96083 1.46347
H  4.591671 -3.058924 1.777959
H  3.270676 -3.572648 0.753018
H  -5.675232 1.610564 -0.525602
H  -4.631713 1.823073 -1.909604
H  -4.100686 -2.445505 -1.287431
H  -4.737306 -2.538024 0.335966
H  -6.666719 0.280869 -2.285019
H  -5.117789 -0.370878 -2.779163
H  -6.474324 -2.048278 -1.511991
H  -6.510754 -0.975527 -0.127767
elementType: O N C H
totalener: -1094.88049828 hartree
nucrepener: 2049.27409337 hartree
electener: -3144.15459164 hartree
oneelecener: -5560.63848627 hartree
twoeener: 2416.48389463 hartree
cpcmener: -0.02950634 hartree
kineticenergy: 1090.04130632 hartree
xcener: -105.969600085304 hartree
chargesum: 0.0000000
charge: -0.276581 -0.475423 -0.407637 -0.407743 -0.114049 0.148018 -0.043608 -0.064792 -0.271095 -0.291865 -0.273777 0.385243 -0.012202 0.090687 -0.227345 -0.249053 -0.072996 -0.072942 -0.070931 -0.072432 -0.134769 -0.135376 0.317774 0.321088 0.100601 0.089893 0.098688 0.094874 0.093175 0.099570 0.089284 0.100877 0.123760 0.131210 0.130058 0.094656 0.094085 0.088322 0.082005 0.101042 0.094086 0.100722 0.092959 0.101701 0.093429 0.080040 0.078231 0.080982 0.077554
qa: -0.2766 -0.4754 -0.4076 -0.4077 -0.1140 0.1480 -0.0436 -0.0648 -0.2711 -0.2919 -0.2738 0.3852 -0.0122 0.0907 -0.2273 -0.2491 -0.0730 -0.0729 -0.0709 -0.0724 -0.1348 -0.1354 0.3178 0.3211 0.1006 0.0899 0.0987 0.0949 0.0932 0.0996 0.0893 0.1009 0.1238 0.1312 0.1301 0.0947 0.0941 0.0883 0.0820 0.1010 0.0941 0.1007 0.0930 0.1017 0.0934 0.0800 0.0782 0.0810 0.0776
va: 2.1091 2.0266 2.1106 2.1104 3.1271 3.7334 3.8334 3.8215 3.8822 3.9171 3.8832 4.1344 3.7072 3.8858 3.9288 3.9463 3.6735 3.6698 3.9207 3.9215 3.9157 3.9148 4.2174 4.2151 1.0243 1.0310 0.9998 1.0010 1.0184 1.0024 1.0015 0.9987 1.0029 1.0035 1.0018 0.9967 0.9954 1.0073 1.0135 0.9977 0.9994 1.0045 1.0156 1.0048 1.0152 1.0096 1.0067 1.0096 1.0068
dispcorr: -0.022057935 hartree
energy: -1094.902556210070
dipole: 17.20742 -18.57093 -1.36350 -7.39884 6.66166 -0.73718 -11.47055 9.92040 -1.55015
magnitude: 2.19215 au
magnitude: 5.57201 debye
