program: Gaussian 09
title: 000068044
version: EM64L-G09RevD.01
frameworkgroup: C1[X(C11H21FO2)]
method: RPBEPBE
basis: SDD
operation: Freq
keyword: #p
keyword: freq=noraman
keyword: PBEPBE/SDD
title: #p freq=noraman PBEPBE/SDD
converged: YES YES NO NO
title: Mulliken charges:
elementType: F O O C C C C C C C C C C C H H H H H H H H H H H H H H H H H H H H H
charge: -0.251506 -0.418126 -0.230898 -0.382234 -0.383863 -0.384959 -0.370235 -0.368524 -0.362308 -0.375982 -0.404320 -0.487992 -0.220459 0.171062 0.194319 0.191583 0.198054 0.192918 0.195933 0.197859 0.195340 0.186073 0.191913 0.190658 0.187562 0.222067 0.216664 0.219430 0.194487 0.223054 0.252183 0.252069 0.192451 0.200590 0.375135
chargesum: 0.00000
title: Mulliken charges with hydrogens summed into heavy atoms:
elementType: F O O C C C C C C C C C C C
charge: -0.251506 -0.042991 -0.230898 0.003668 0.007109 0.008834 0.011178 0.014047 0.047321 0.060112 0.013220 0.016260 0.172582 0.171062
polarizability: 1.67272058e+02 1.74514621e-01 1.13308979e+02 1.46943938e+00 -3.17742787e+00 9.82821706e+01
1716.lowfreq: -20.9007 -0.0009 -0.0008 0.0006 0.5389 9.5102 11.9228 17.0370 32.7340
frequency: -7.8450 16.8409 32.5794 44.6791 49.8916 75.4008 82.3182 93.3180 115.0643 123.8158 140.4230 151.9574 168.7072 181.6688 246.0629 309.6880 345.0045 400.4796 462.4024 480.4279 500.7805 518.2852 588.8373 639.6193 720.6280 723.8092 734.2675 757.5079 797.1215 846.3634 856.8986 874.7085 900.8426 950.6123 988.7101 995.3664 1009.2071 1026.6768 1039.3334 1062.1395 1069.8661 1082.2213 1083.8502 1090.4659 1111.7611 1116.9597 1137.5712 1184.8220 1199.8580 1215.0676 1231.1446 1238.9549 1256.9270 1263.2203 1279.4967 1283.0458 1286.5143 1290.9709 1296.2342 1297.0694 1316.6146 1341.9812 1356.1528 1359.6071 1369.0369 1373.8181 1374.2884 1437.3528 1442.4271 1460.3449 1460.6286 1464.3358 1467.2147 1467.7692 1475.9528 1483.1212 1488.0842 1669.4283 2948.2543 2949.0459 2951.0135 2955.5951 2962.2719 2965.6359 2971.4300 2982.9828 2985.4716 2988.8013 2994.8948 2997.5937 3000.5402 3014.6359 3023.8248 3029.7083 3036.7467 3049.9750 3060.8793 3073.7686 3510.2134
redmass: 4.5623 6.3034 4.4536 3.4155 2.4141 2.2704 3.3321 2.8775 2.6527 2.3422 2.4146 1.9903 3.0325 4.4396 3.1098 3.6871 3.7399 3.6643 3.2253 3.2668 1.8058 2.8077 4.6588 1.3109 1.0609 1.0879 1.1525 1.2783 1.4239 1.7189 4.8759 2.0083 1.5864 1.4715 4.9538 3.4992 1.3458 3.4684 2.2034 2.8848 2.3372 2.0734 2.2149 2.2222 3.3690 1.4642 1.5631 1.2957 1.5098 1.3147 1.3848 1.3786 1.3687 1.3033 1.0716 1.1870 1.1696 1.1448 1.1173 1.1251 1.3998 1.4812 1.6523 1.6321 1.5886 1.3293 1.7056 1.0848 1.0816 1.0697 1.0777 1.0638 1.0925 1.0885 1.0959 1.0993 1.1005 8.2106 1.0591 1.0587 1.0592 1.0598 1.0603 1.0615 1.0626 1.0958 1.0615 1.0974 1.0599 1.0999 1.0591 1.1004 1.0981 1.0997 1.1037 1.1027 1.1031 1.1107 1.0639
irintensity: 1.2296 0.2629 0.0430 0.6462 1.9796 0.5788 1.9755 0.6104 0.3961 0.1555 0.1444 0.0849 4.7136 0.5756 1.4062 3.8082 1.0086 0.6991 1.5629 33.2702 26.9773 3.0713 14.1098 129.6116 18.0674 2.3087 5.5607 3.4363 1.1353 18.8475 1.2789 4.3643 7.1105 15.6279 40.6995 27.0129 4.2578 78.7060 113.6501 12.7965 29.1686 0.1050 2.1240 19.1998 9.2186 0.6018 4.8382 21.9502 10.5074 11.9687 0.1219 0.0829 1.4694 4.2877 0.5725 6.0292 4.2234 6.3422 0.2136 1.7196 9.6505 16.1794 2.1812 2.9718 1.5035 17.7809 21.0312 27.4230 6.8059 0.0106 0.2192 0.0740 4.5746 0.3065 4.0556 0.5754 32.2968 208.8002 2.3578 0.2652 10.0274 1.0993 49.0256 87.7957 64.5779 4.1653 5.1466 3.0396 38.2707 7.5129 52.4499 2.8798 14.0917 3.5582 54.6095 129.9111 91.8554 61.8405 17.7714
temp: 298.150 k
press: 1.00000 atm
elementType: 9 8 8 6 6 6 6 6 6 6 6 6 6 6 1 1 1 1 1 1 1 1 1 1 1 1 1 1 1 1 1 1 1 1 1
symmnumber: 1
zpe: 797489.9 jmol-1
zpe.correction: 0.303748 hartree
zpe.thermalcorrener: 0.320491 hartree
zpe.thermalcorrenthalpy: 0.321435 hartree
zpe.thermalcorrgfe: 0.255748 hartree
zpe.sumelectzpe: -680.916452 hartree
zpe.sumelectthermal: -680.899709 hartree
zpe.sumelectthermalent: -680.898765 hartree
zpe.sumelectthermalfe: -680.964452 hartree
dipole: 0.1686 -2.9478 -1.2971
dipole: 3.2249
quadrupole: -91.5525 -93.7107 -85.7297
quadrupole: 3.9633 13.8186 0.2098
quadrupole: -1.2215 -3.3797 4.6013 3.9633 13.8186 0.2098
hfenergy: -681.2201999 hartree
pointgroup: C01 [X(C11H21F1O2)]
dipole: 0.0619451 -1.1469582 -0.538967 debye
polarizability: 167.2784045|-0.0199958|113.4565726|1.3163607|-2.8060843|98.128231 unknown
InChI: InChI=1S/C11H21FO2/c12-10-8-6-4-2-1-3-5-7-9-11(13)14/h13H,1-10H2
charge 0 multiplicity 1
35 atoms
F  -7.075872 1.007401 0.90173
O  7.017102 -0.58534 0.232496
O  5.986742 1.439586 -0.242197
C  -0.529529 -0.61812 0.056237
C  -1.822673 0.195484 -0.174446
C  0.758207 0.218485 -0.113555
C  -3.10775 -0.653381 -0.049527
C  2.049534 -0.591312 0.139319
C  -4.401181 0.168924 -0.239703
C  3.33231 0.245804 -0.055623
C  -5.678267 -0.696031 -0.160557
C  4.60842 -0.57721 0.202146
C  -6.968887 0.111978 -0.262108
C  5.883751 0.224527 0.033226
H  -0.550788 -1.05697 1.075867
H  -0.504739 -1.474949 -0.649845
H  -1.864436 1.032415 0.553409
H  -1.788039 0.661588 -1.181495
H  0.786601 0.642757 -1.138889
H  0.727641 1.084957 0.579551
H  -3.129121 -1.140874 0.947636
H  -3.076812 -1.474964 -0.796422
H  2.02634 -1.001534 1.170951
H  2.070079 -1.467209 -0.543236
H  -4.367806 0.687288 -1.221103
H  -4.456686 0.960299 0.533034
H  3.360648 0.655707 -1.083573
H  3.317792 1.121799 0.620883
H  -5.677901 -1.443808 -0.98157
H  -5.688436 -1.266336 0.789081
H  4.609296 -0.998026 1.227488
H  4.665391 -1.451696 -0.475527
H  -6.982851 0.762883 -1.157004
H  -7.868243 -0.530673 -0.240063
H  7.836063 -0.029951 0.119489
