program: Orca
programVersion: 5.0.2
elementType: O O O O N C C C C C C C C C C C C C C C C C C C H H H H H H H H H H H H H H H H H H H H H H H H H
charge: 0
multiplicity: 1
keywords: wb97x-d3
keywords: def2-TZVPP
keywords: def2/J RIJCOSX
keywords: DEFGRID2
keywords: scfconv7
keywords: smallprint printgap noloewdin
keywords: NOSOSCF
formula: C19H25NO4
InChI: InChI=1/C19H25NO4/c1-11(2)9-14-15(19(14,3)4)18(23)24-10-20-16(21)12-7-5-6-8-13(12)17(20)22/h9,14-15H,5-8,10H2,1-4H3
49 atoms
O  0.599691 1.863346 -1.175988
O  0.291292 -0.316136 -1.56903
O  -2.714153 0.138365 -2.302094
O  -1.183885 2.624342 1.183918
N  -1.717219 1.589586 -0.804938
C  2.398698 -0.12648 0.896526
C  2.889124 -0.926257 -0.282014
C  2.301008 0.441836 -0.507749
C  1.148275 -0.585069 1.606712
C  3.396601 0.530983 1.816826
C  4.323215 -1.161019 -0.545475
C  0.977793 0.58012 -1.145932
C  4.868117 -2.359674 -0.772738
C  -0.709408 2.172089 -1.633625
C  6.330888 -2.505987 -1.058808
C  4.065038 -3.634293 -0.773243
C  -3.287425 0.134779 0.046893
C  -2.852214 0.873805 1.067754
C  -4.307124 -0.93758 0.143565
C  -3.326922 0.761548 2.46825
C  -4.5152 -1.309346 1.613182
C  -4.607591 -0.074913 2.509189
C  -2.576367 0.561502 -1.184678
C  -1.823929 1.815615 0.561386
H  2.233091 -1.745302 -0.559141
H  2.989334 1.254314 -0.718301
H  1.409976 -1.27104 2.414824
H  0.450282 -1.108564 0.954334
H  0.621131 0.260731 2.05448
H  4.265796 0.920701 1.288535
H  3.754918 -0.179137 2.565119
H  2.935151 1.365606 2.348648
H  4.968869 -0.287829 -0.564943
H  -0.86755 1.842519 -2.660518
H  -0.765729 3.257448 -1.599907
H  6.495914 -2.981202 -2.029821
H  6.81452 -3.148033 -0.317679
H  6.849017 -1.54677 -1.062958
H  3.456035 -3.741031 0.12583
H  4.712713 -4.509352 -0.830131
H  3.386136 -3.68631 -1.628036
H  -5.242593 -0.590258 -0.306748
H  -3.999046 -1.808748 -0.43947
H  -2.542296 0.301524 3.077545
H  -3.494111 1.753292 2.894784
H  -5.419373 -1.911358 1.713501
H  -3.683645 -1.93684 1.945493
H  -4.815161 -0.374681 3.537222
H  -5.450582 0.54301 2.188119
elementType: O N C H
totalener: -1094.87745342 hartree
nucrepener: 2139.05257579 hartree
electener: -3233.93002920 hartree
oneelecener: -5740.60810936 hartree
twoeener: 2506.67808016 hartree
cpcmener: -0.03251780 hartree
kineticenergy: 1090.04412299 hartree
xcener: -105.971617660153 hartree
chargesum: 0.0000000
charge: -0.271597 -0.445607 -0.400638 -0.408327 -0.098177 0.127674 0.031074 -0.114348 -0.280666 -0.272118 -0.302661 0.377967 -0.013121 0.084146 -0.220763 -0.283693 -0.034461 -0.086755 -0.076631 -0.068886 -0.135047 -0.138585 0.298909 0.292975 0.092660 0.097481 0.103919 0.090499 0.091202 0.087789 0.097214 0.098073 0.117020 0.133763 0.143273 0.097654 0.095028 0.084283 0.102367 0.094827 0.104184 0.100030 0.093852 0.101084 0.094596 0.080465 0.078806 0.080650 0.078617
qa: -0.2716 -0.4456 -0.4006 -0.4083 -0.0982 0.1277 0.0311 -0.1143 -0.2807 -0.2721 -0.3027 0.3780 -0.0131 0.0841 -0.2208 -0.2837 -0.0345 -0.0868 -0.0766 -0.0689 -0.1350 -0.1386 0.2989 0.2930 0.0927 0.0975 0.1039 0.0905 0.0912 0.0878 0.0972 0.0981 0.1170 0.1338 0.1433 0.0977 0.0950 0.0843 0.1024 0.0948 0.1042 0.1000 0.0939 0.1011 0.0946 0.0805 0.0788 0.0806 0.0786
va: 2.1180 2.0642 2.1155 2.0997 3.0669 3.6973 3.7911 3.8293 3.9016 3.9047 3.8891 4.2422 3.6992 3.8873 3.9221 3.9407 3.6235 3.6966 3.9153 3.9172 3.9142 3.9183 4.2173 4.1973 1.0276 1.0322 1.0018 1.0142 1.0093 1.0053 1.0018 1.0024 1.0095 1.0147 0.9922 0.9927 0.9935 1.0103 0.9959 1.0045 0.9962 1.0043 1.0158 1.0060 1.0157 1.0094 1.0071 1.0095 1.0060
dispcorr: -0.024871313 hartree
energy: -1094.902324730648
dipole: 17.58800 -17.96313 -0.37514 -18.25115 17.97433 -0.27681 13.48287 -12.04255 1.44032
magnitude: 1.51389 au
magnitude: 3.84800 debye
