program: Orca
programVersion: 5.0.2
elementType: O O O O N C C C C C C C C C C C C C C C C C C C H H H H H H H H H H H H H H H H H H H H H H H H H
charge: 0
multiplicity: 1
keywords: wb97x-d3
keywords: def2-TZVPP
keywords: def2/J RIJCOSX
keywords: DEFGRID2
keywords: scfconv7
keywords: smallprint printgap noloewdin
keywords: NOSOSCF
formula: C19H25NO4
InChI: InChI=1/C19H25NO4/c1-11(2)9-14-15(19(14,3)4)18(23)24-10-20-16(21)12-7-5-6-8-13(12)17(20)22/h9,14-15H,5-8,10H2,1-4H3
49 atoms
O  0.241731 1.41783 0.143778
O  1.575701 1.141065 1.923661
O  -2.973672 2.625269 -0.917316
O  -1.574193 -0.813104 1.697745
N  -2.013651 1.143232 0.566748
C  3.737663 1.082204 -0.394201
C  3.538923 -0.281649 0.195889
C  2.332842 0.514987 -0.258616
C  4.203891 2.192184 0.515313
C  4.257568 1.216835 -1.804687
C  3.892498 -1.523556 -0.521755
C  1.382041 1.040371 0.737397
C  4.618179 -2.537944 -0.039044
C  -0.847653 1.867361 0.941664
C  4.886191 -3.754981 -0.873286
C  5.216349 -2.583337 1.334607
C  -3.905832 0.423068 -0.528539
C  -3.497774 -0.586569 0.241822
C  -5.109645 0.40247 -1.394968
C  -4.16598 -1.905818 0.346826
C  -5.987049 -0.795031 -1.024071
C  -5.164526 -2.063749 -0.801705
C  -2.955684 1.553488 -0.369564
C  -2.261338 -0.170054 0.94687
H  3.661781 -0.312281 1.27319
H  1.877642 0.21048 -1.194873
H  5.293919 2.252016 0.488998
H  3.914149 2.048035 1.554138
H  3.815506 3.159002 0.18795
H  3.854854 0.463865 -2.481036
H  5.346005 1.128806 -1.82104
H  3.999266 2.195344 -2.214532
H  3.512988 -1.614431 -1.535591
H  -1.008306 2.9265 0.748181
H  -0.650031 1.727613 2.002472
H  4.519796 -4.658694 -0.378357
H  5.959448 -3.900717 -1.023192
H  4.415338 -3.696284 -1.854747
H  5.123246 -1.651034 1.888237
H  6.280312 -2.827128 1.280139
H  4.751849 -3.372222 1.933039
H  -5.665012 1.33837 -1.297291
H  -4.797906 0.346281 -2.443052
H  -3.425087 -2.708975 0.334834
H  -4.671678 -1.978793 1.315144
H  -6.545085 -0.562814 -0.112295
H  -6.727306 -0.961475 -1.807925
H  -4.621153 -2.308821 -1.71882
H  -5.825778 -2.906876 -0.596744
elementType: O N C H
totalener: -1094.88034133 hartree
nucrepener: 2049.00835386 hartree
electener: -3143.88869519 hartree
oneelecener: -5560.29716755 hartree
twoeener: 2416.40847236 hartree
cpcmener: -0.03157185 hartree
kineticenergy: 1090.03507339 hartree
xcener: -105.969960775133 hartree
chargesum: 0.0000000
charge: -0.279420 -0.458727 -0.409346 -0.409033 -0.103645 0.105738 0.048171 -0.129977 -0.275430 -0.266048 -0.279098 0.415391 -0.041515 0.083071 -0.219392 -0.255462 -0.083860 -0.056130 -0.073187 -0.072395 -0.135992 -0.135322 0.324102 0.313405 0.089801 0.091436 0.096067 0.092812 0.098080 0.087933 0.097206 0.097830 0.116735 0.126529 0.136789 0.092870 0.093089 0.087605 0.090805 0.092922 0.099070 0.093610 0.101373 0.093205 0.100488 0.077896 0.080945 0.078059 0.080947
qa: -0.2794 -0.4587 -0.4093 -0.4090 -0.1036 0.1057 0.0482 -0.1300 -0.2754 -0.2660 -0.2791 0.4154 -0.0415 0.0831 -0.2194 -0.2555 -0.0839 -0.0561 -0.0732 -0.0724 -0.1360 -0.1353 0.3241 0.3134 0.0898 0.0914 0.0961 0.0928 0.0981 0.0879 0.0972 0.0978 0.1167 0.1265 0.1368 0.0929 0.0931 0.0876 0.0908 0.0929 0.0991 0.0936 0.1014 0.0932 0.1005 0.0779 0.0809 0.0781 0.0809
va: 2.1071 2.0558 2.1088 2.1083 3.1049 3.7042 3.7582 3.8350 3.9077 3.9085 3.8812 4.1804 3.7559 3.8536 3.9231 3.9436 3.6919 3.6537 3.9208 3.9201 3.9140 3.9143 4.2261 4.2243 1.0346 1.0368 1.0002 1.0177 0.9997 1.0057 1.0021 1.0021 1.0110 1.0103 1.0205 0.9955 0.9967 1.0089 1.0089 0.9979 0.9961 1.0155 1.0049 1.0161 1.0047 1.0066 1.0095 1.0068 1.0096
dispcorr: -0.021811923 hartree
energy: -1094.902153252462
dipole: 20.89833 -21.96776 -1.06943 -14.56630 13.60571 -0.96059 -7.88405 6.60131 -1.28274
magnitude: 1.92661 au
magnitude: 4.89706 debye
