program: Orca
programVersion: 5.0.2
elementType: O O O O N C C C C C C C C C C C C C C C C C C C H H H H H H H H H H H H H H H H H H H H H H H H H
charge: 0
multiplicity: 1
keywords: wb97x-d3
keywords: def2-TZVPP
keywords: def2/J RIJCOSX
keywords: DEFGRID2
keywords: scfconv7
keywords: smallprint printgap noloewdin
keywords: NOSOSCF
formula: C19H25NO4
InChI: InChI=1/C19H25NO4/c1-11(2)9-14-15(19(14,3)4)18(23)24-10-20-16(21)12-7-5-6-8-13(12)17(20)22/h9,14-15H,5-8,10H2,1-4H3
49 atoms
O  0.423858 0.954281 0.626592
O  1.800533 2.06163 -0.751729
O  -2.8585 1.339461 2.266261
O  -1.362747 0.556894 -1.948307
N  -1.828025 1.216717 0.206026
C  2.788722 -0.905313 -1.237206
C  3.802083 -0.12425 -0.468379
C  2.370482 -0.133522 0.010434
C  2.374588 -0.426147 -2.606163
C  2.760179 -2.408022 -1.098835
C  4.868855 -0.798311 0.317162
C  1.542088 1.078486 -0.101828
C  5.235199 -0.503106 1.566909
C  -0.614127 1.913588 0.471631
C  6.341258 -1.25223 2.24627
C  4.600774 0.574343 2.391785
C  -3.829218 0.102217 0.425787
C  -3.390362 -0.13449 -0.811453
C  -5.109973 -0.39337 0.98612
C  -4.093011 -0.958078 -1.824728
C  -6.000373 -0.897227 -0.151375
C  -5.22149 -1.746335 -1.154815
C  -2.830505 0.946209 1.12917
C  -2.0880 0.55475 -0.986464
H  4.100297 0.806113 -0.947846
H  2.146952 -0.753633 0.87155
H  2.993362 -0.910248 -3.364703
H  2.48725 0.648044 -2.736302
H  1.334832 -0.684634 -2.818071
H  3.024277 -2.742007 -0.095118
H  3.457947 -2.873323 -1.79866
H  1.764088 -2.794367 -1.32405
H  5.409496 -1.587077 -0.200282
H  -0.396094 2.607182 -0.33806
H  -0.723838 2.474348 1.398294
H  5.99223 -1.708631 3.176499
H  7.159585 -0.581319 2.520619
H  6.750888 -2.04277 1.617332
H  4.09794 0.150231 3.265489
H  3.873915 1.169813 1.84291
H  5.362297 1.256355 2.778907
H  -4.906527 -1.193881 1.704954
H  -5.608496 0.397788 1.551432
H  -4.486649 -0.305069 -2.610434
H  -3.388829 -1.63089 -2.320475
H  -6.829095 -1.474358 0.261573
H  -6.442622 -0.03992 -0.667208
H  -5.896321 -2.135869 -1.918439
H  -4.798948 -2.614162 -0.640278
elementType: O N C H
totalener: -1094.87807840 hartree
nucrepener: 2085.54506647 hartree
electener: -3180.42314488 hartree
oneelecener: -5633.36186423 hartree
twoeener: 2452.93871935 hartree
cpcmener: -0.02945506 hartree
kineticenergy: 1090.04298946 hartree
xcener: -105.971103020375 hartree
chargesum: 0.0000000
charge: -0.280966 -0.455618 -0.408923 -0.415210 -0.095777 0.143533 0.007546 -0.133925 -0.283301 -0.281801 -0.301108 0.389336 -0.014306 0.078565 -0.228150 -0.239879 -0.084620 -0.055391 -0.074729 -0.069142 -0.133145 -0.137719 0.325719 0.312518 0.102093 0.102126 0.097269 0.095047 0.093248 0.092561 0.097975 0.098852 0.119640 0.140863 0.124571 0.093292 0.096316 0.088564 0.099227 0.086202 0.101208 0.101752 0.093495 0.100332 0.094422 0.080577 0.077768 0.080672 0.078419
qa: -0.2810 -0.4556 -0.4089 -0.4152 -0.0958 0.1435 0.0075 -0.1339 -0.2833 -0.2818 -0.3011 0.3893 -0.0143 0.0786 -0.2282 -0.2399 -0.0846 -0.0554 -0.0747 -0.0691 -0.1331 -0.1377 0.3257 0.3125 0.1021 0.1021 0.0973 0.0950 0.0932 0.0926 0.0980 0.0989 0.1196 0.1409 0.1246 0.0933 0.0963 0.0886 0.0992 0.0862 0.1012 0.1018 0.0935 0.1003 0.0944 0.0806 0.0778 0.0807 0.0784
va: 2.0993 2.0536 2.1099 2.0967 3.0950 3.7081 3.7929 3.8298 3.8942 3.9034 3.8907 4.1563 3.7185 3.8565 3.9303 3.9301 3.6986 3.6622 3.9202 3.9176 3.9122 3.9166 4.2225 4.2123 1.0254 1.0267 1.0021 1.0168 1.0065 1.0030 1.0009 1.0028 1.0048 1.0164 1.0139 0.9971 0.9964 1.0067 0.9987 1.0109 0.9998 1.0049 1.0158 1.0052 1.0151 1.0100 1.0067 1.0095 1.0065
dispcorr: -0.023442487 hartree
energy: -1094.901520890313
dipole: 15.33577 -16.76547 -1.42970 -16.36373 14.72315 -1.64058 -0.34099 0.55893 0.21794
magnitude: 2.18702 au
magnitude: 5.55897 debye
