program: Orca
programVersion: 5.0.2
elementType: O O O O N C C C C C C C C C C C C C C C C C C C H H H H H H H H H H H H H H H H H H H H H H H H H
charge: 0
multiplicity: 1
keywords: wb97x-d3
keywords: def2-TZVPP
keywords: def2/J RIJCOSX
keywords: DEFGRID2
keywords: scfconv7
keywords: smallprint printgap noloewdin
keywords: NOSOSCF
formula: C19H25NO4
InChI: InChI=1/C19H25NO4/c1-11(2)9-14-15(19(14,3)4)18(23)24-10-20-16(21)12-7-5-6-8-13(12)17(20)22/h9,14-15H,5-8,10H2,1-4H3
49 atoms
O  0.420181 1.037873 -0.025656
O  1.779906 1.270926 -1.79568
O  -2.652152 2.355881 1.369608
O  -1.661857 -0.56796 -1.972625
N  -1.853799 1.125505 -0.415821
C  2.677413 -1.55684 -0.626686
C  3.75842 -0.532064 -0.525392
C  2.380304 -0.198919 -0.007208
C  2.125676 -1.906805 -1.987428
C  2.675598 -2.720118 0.335385
C  4.907337 -0.688777 0.403664
C  1.535898 0.774761 -0.729462
C  5.547023 0.309423 1.014335
C  -0.611707 1.78246 -0.651325
C  6.731144 0.053843 1.896848
C  5.15972 1.748433 0.864065
C  -3.822093 0.407524 0.537174
C  -3.532348 -0.449333 -0.441489
C  -5.031989 0.343915 1.394946
C  -4.35541 -1.624469 -0.821236
C  -6.050262 -0.611792 0.769477
C  -5.392181 -1.898463 0.270504
C  -2.746385 1.434122 0.608609
C  -2.252663 -0.033972 -1.075759
H  3.993967 -0.040828 -1.466594
H  2.241298 -0.208786 1.068137
H  1.079188 -2.209392 -1.92217
H  2.68879 -2.742161 -2.407202
H  2.187533 -1.081588 -2.692978
H  3.303609 -3.531428 -0.038963
H  1.665146 -3.114689 0.453793
H  3.042419 -2.44616 1.324511
H  5.271271 -1.700649 0.558267
H  -0.433319 1.866797 -1.722147
H  -0.660866 2.776761 -0.209032
H  7.624443 0.546611 1.504733
H  6.950102 -1.009191 1.991992
H  6.569091 0.456086 2.900067
H  5.996057 2.331471 0.4704
H  4.908268 2.186226 1.833352
H  4.311882 1.894368 0.198307
H  -4.748527 0.007157 2.397355
H  -5.456692 1.341267 1.52793
H  -4.843826 -1.429388 -1.781462
H  -3.717819 -2.49571 -0.987756
H  -6.830792 -0.846506 1.494496
H  -6.545281 -0.111347 -0.067821
H  -6.150754 -2.586602 -0.105291
H  -4.905351 -2.403414 1.109872
totalener: -1094.85445013 hartree
nucrepener: 2075.60697886 hartree
electener: -3170.46142899 hartree
oneelecener: -5613.13094821 hartree
twoeener: 2442.66951922 hartree
kineticenergy: 1090.09055773 hartree
xcener: -105.970185781438 hartree
chargesum: 0.0000000
charge: -0.266551 -0.375024 -0.318983 -0.323399 -0.111613 0.124538 -0.022034 -0.110515 -0.245242 -0.278596 -0.235717 0.339206 -0.006824 0.068102 -0.211727 -0.224752 -0.100725 -0.070952 -0.076077 -0.073276 -0.134616 -0.135585 0.270584 0.254584 0.106295 0.086424 0.090983 0.083037 0.096868 0.090596 0.091109 0.084292 0.092723 0.137920 0.114017 0.086967 0.077990 0.083733 0.088822 0.085487 0.082302 0.093581 0.094050 0.093335 0.093879 0.080456 0.075002 0.080084 0.075244
qa: -0.2666 -0.3750 -0.3190 -0.3234 -0.1116 0.1245 -0.0220 -0.1105 -0.2452 -0.2786 -0.2357 0.3392 -0.0068 0.0681 -0.2117 -0.2248 -0.1007 -0.0710 -0.0761 -0.0733 -0.1346 -0.1356 0.2706 0.2546 0.1063 0.0864 0.0910 0.0830 0.0969 0.0906 0.0911 0.0843 0.0927 0.1379 0.1140 0.0870 0.0780 0.0837 0.0888 0.0855 0.0823 0.0936 0.0940 0.0933 0.0939 0.0805 0.0750 0.0801 0.0752
va: 2.1079 2.1262 2.1956 2.1831 3.0906 3.7721 3.8292 3.8235 3.8977 3.9083 3.8986 4.1946 3.7325 3.8868 3.9415 3.9411 3.6543 3.6179 3.9241 3.9246 3.8971 3.8987 4.2772 4.2710 1.0263 1.0305 1.0077 1.0014 1.0204 1.0014 1.0065 1.0047 1.0090 1.0148 1.0106 0.9982 1.0097 0.9994 1.0017 1.0009 1.0200 1.0083 1.0195 1.0084 1.0191 1.0118 1.0089 1.0117 1.0087
dispcorr: -0.023151397 hartree
energy: -1094.877601530236
dipole: 16.24537 -17.33838 -1.09301 -13.73920 12.82484 -0.91437 6.78761 -6.06429 0.72332
magnitude: 1.59810 au
magnitude: 4.06205 debye
