program: Orca
programVersion: 5.0.2
elementType: O O O O N C C C C C C C C C C C C C C C C C C C H H H H H H H H H H H H H H H H H H H H H H H H H
charge: 0
multiplicity: 1
keywords: wb97x-d3
keywords: def2-TZVPP
keywords: def2/J RIJCOSX
keywords: DEFGRID2
keywords: scfconv7
keywords: smallprint printgap noloewdin
keywords: NOSOSCF
formula: C19H25NO4
InChI: InChI=1/C19H25NO4/c1-11(2)9-14-15(19(14,3)4)18(23)24-10-20-16(21)12-7-5-6-8-13(12)17(20)22/h9,14-15H,5-8,10H2,1-4H3
49 atoms
O  0.031036 -0.983508 0.207392
O  1.433764 -1.43145 1.893577
O  -1.800106 1.298578 1.603526
O  -3.16847 -2.234787 -0.913614
N  -2.223709 -0.700948 0.532101
C  2.941508 0.963223 0.472699
C  3.687129 -0.329912 0.303479
C  2.22074 -0.26871 -0.045953
C  2.670092 1.464814 1.870793
C  3.15383 2.080505 -0.520125
C  4.682416 -0.533789 -0.767621
C  1.231497 -0.962429 0.805871
C  5.937142 -0.965834 -0.622691
C  -1.081014 -1.42523 0.971129
C  6.835135 -1.126154 -1.813166
C  6.572096 -1.319151 0.688111
C  -3.664888 1.03562 0.081458
C  -4.05837 0.003565 -0.664644
C  -4.335403 2.358964 0.131464
C  -5.219114 0.013437 -1.590052
C  -5.718805 2.254795 -0.513918
C  -5.68012 1.455229 -1.81697
C  -2.457252 0.634603 0.851655
C  -3.141157 -1.143142 -0.418309
H  3.886054 -0.846524 1.236018
H  1.962548 -0.2403 -1.099351
H  2.619998 0.665596 2.606248
H  1.727958 2.015375 1.911224
H  3.46612 2.146355 2.175855
H  4.043165 2.657121 -0.259907
H  2.300966 2.761318 -0.513146
H  3.282863 1.726144 -1.541828
H  4.349752 -0.306887 -1.776598
H  -0.914809 -1.248832 2.032977
H  -1.255954 -2.487897 0.803582
H  7.735841 -0.515267 -1.71162
H  6.341655 -0.842364 -2.742014
H  7.171787 -2.160942 -1.915223
H  5.900968 -1.223939 1.53844
H  7.436267 -0.677888 0.879411
H  6.945866 -2.345908 0.672349
H  -4.40673 2.708767 1.163737
H  -3.717958 3.098526 -0.38871
H  -4.956117 -0.469873 -2.533614
H  -6.027365 -0.590127 -1.16459
H  -6.405866 1.771131 0.186386
H  -6.117037 3.253689 -0.69769
H  -4.997955 1.943585 -2.518947
H  -6.663723 1.45838 -2.288817
totalener: -1094.85570356 hartree
nucrepener: 2045.44824050 hartree
electener: -3140.30394406 hartree
oneelecener: -5552.71877840 hartree
twoeener: 2412.41483434 hartree
kineticenergy: 1090.08973476 hartree
xcener: -105.970419452458 hartree
chargesum: -0.0000000
charge: -0.264306 -0.380865 -0.323399 -0.318314 -0.116356 0.088137 0.041592 -0.085595 -0.258286 -0.245427 -0.188308 0.334314 -0.049210 0.078168 -0.204602 -0.235189 -0.070621 -0.100438 -0.075964 -0.073961 -0.135144 -0.135710 0.257148 0.266356 0.089359 0.071366 0.096252 0.096706 0.083633 0.091549 0.093363 0.069694 0.071073 0.129061 0.118763 0.082296 0.076073 0.085443 0.083413 0.084925 0.085441 0.094063 0.093390 0.095316 0.092596 0.075923 0.080424 0.075815 0.080043
qa: -0.2643 -0.3809 -0.3234 -0.3183 -0.1164 0.0881 0.0416 -0.0856 -0.2583 -0.2454 -0.1883 0.3343 -0.0492 0.0782 -0.2046 -0.2352 -0.0706 -0.1004 -0.0760 -0.0740 -0.1351 -0.1357 0.2571 0.2664 0.0894 0.0714 0.0963 0.0967 0.0836 0.0915 0.0934 0.0697 0.0711 0.1291 0.1188 0.0823 0.0761 0.0854 0.0834 0.0849 0.0854 0.0941 0.0934 0.0953 0.0926 0.0759 0.0804 0.0758 0.0800
va: 2.1103 2.1220 2.1846 2.1957 3.0985 3.7601 3.7827 3.8931 3.9127 3.9112 3.8981 4.2333 3.8183 3.8929 3.9358 3.9464 3.6156 3.6566 3.9269 3.9241 3.8966 3.8990 4.2736 4.2776 1.0366 1.0368 1.0211 1.0046 1.0009 1.0048 1.0041 1.0107 1.0204 1.0102 1.0078 0.9983 1.0122 0.9981 1.0156 0.9991 0.9994 1.0187 1.0084 1.0187 1.0085 1.0088 1.0118 1.0086 1.0118
dispcorr: -0.022051644 hartree
energy: -1094.877755201532
dipole: 22.77111 -23.61697 -0.84587 11.49213 -10.40471 1.08742 -6.59292 5.75534 -0.83758
magnitude: 1.61230 au
magnitude: 4.09814 debye
