program: Orca
programVersion: 5.0.2
elementType: O O O O N C C C C C C C C C C C C C C C C C C C H H H H H H H H H H H H H H H H H H H H H H H H H
charge: 0
multiplicity: 1
keywords: wb97x-d3
keywords: def2-TZVPP
keywords: def2/J RIJCOSX
keywords: DEFGRID2
keywords: scfconv7
keywords: smallprint printgap noloewdin
keywords: NOSOSCF
formula: C19H25NO4
InChI: InChI=1/C19H25NO4/c1-11(2)9-14-15(19(14,3)4)18(23)24-10-20-16(21)12-7-5-6-8-13(12)17(20)22/h9,14-15H,5-8,10H2,1-4H3
49 atoms
O  0.523254 1.751126 -1.451995
O  0.282879 -0.474514 -1.38933
O  -1.490419 2.657128 0.683373
O  -2.626977 -0.239686 -2.641133
N  -1.810191 1.40035 -1.227654
C  2.267688 0.066119 1.037409
C  2.906588 -0.734102 -0.062228
C  2.205004 0.550323 -0.402006
C  1.028782 -0.472067 1.710576
C  3.150647 0.863398 1.964616
C  4.378004 -0.833968 -0.218798
C  0.921892 0.510789 -1.134658
C  5.122612 -1.87597 0.153976
C  -0.756312 1.921182 -2.037144
C  6.602517 -1.902197 -0.080906
C  4.56519 -3.094499 0.824076
C  -2.977882 0.750143 0.64495
C  -3.293105 -0.111265 -0.321088
C  -3.504626 0.710223 2.031841
C  -4.215074 -1.263908 -0.167229
C  -4.698816 -0.243822 2.101924
C  -4.443737 -1.533665 1.32141
C  -2.010426 1.742344 0.105998
C  -2.564476 0.269949 -1.559995
H  2.348421 -1.620407 -0.349385
H  2.821128 1.417548 -0.616137
H  0.397567 0.344241 2.070228
H  1.311349 -1.074365 2.576236
H  0.42895 -1.099685 1.054748
H  3.515014 0.233748 2.778576
H  2.594564 1.692794 2.404539
H  4.023486 1.275985 1.46016
H  4.878178 0.008247 -0.68851
H  -0.821115 1.437888 -3.013143
H  -0.857727 2.997665 -2.154615
H  7.148688 -2.027452 0.857473
H  6.959233 -0.990333 -0.558136
H  6.882617 -2.744789 -0.718217
H  4.763686 -3.991799 0.232574
H  3.492414 -3.036126 0.99547
H  5.04578 -3.251055 1.793341
H  -2.707592 0.384287 2.708519
H  -3.780988 1.713405 2.36405
H  -5.161479 -1.043731 -0.671795
H  -3.80761 -2.143024 -0.670923
H  -4.928105 -0.473099 3.143672
H  -5.582013 0.255146 1.692572
H  -5.281625 -2.220749 1.448658
H  -3.564012 -2.03724 1.732858
totalener: -1094.85153466 hartree
nucrepener: 2143.99953885 hartree
electener: -3238.85107350 hartree
oneelecener: -5750.04252721 hartree
twoeener: 2511.19145371 hartree
kineticenergy: 1090.10104780 hartree
xcener: -105.973118256480 hartree
chargesum: 0.0000000
charge: -0.255710 -0.376717 -0.314468 -0.307226 -0.125121 0.152557 -0.013956 -0.115476 -0.301440 -0.241947 -0.198836 0.329921 -0.025220 0.091166 -0.212425 -0.236084 -0.114333 -0.034178 -0.064174 -0.079289 -0.138445 -0.134528 0.231223 0.255119 0.102054 0.075515 0.090464 0.090819 0.095741 0.085980 0.099107 0.076545 0.085208 0.127728 0.119180 0.082933 0.078420 0.086511 0.090563 0.080450 0.084487 0.088050 0.093603 0.090694 0.096645 0.078922 0.074842 0.078775 0.076351
qa: -0.2557 -0.3767 -0.3145 -0.3072 -0.1251 0.1526 -0.0140 -0.1155 -0.3014 -0.2419 -0.1988 0.3299 -0.0252 0.0912 -0.2124 -0.2361 -0.1143 -0.0342 -0.0642 -0.0793 -0.1384 -0.1345 0.2312 0.2551 0.1021 0.0755 0.0905 0.0908 0.0957 0.0860 0.0991 0.0765 0.0852 0.1277 0.1192 0.0829 0.0784 0.0865 0.0906 0.0804 0.0845 0.0880 0.0936 0.0907 0.0966 0.0789 0.0748 0.0788 0.0764
va: 2.1318 2.1265 2.1947 2.2069 3.0719 3.7025 3.7960 3.9152 3.9042 3.9029 3.8821 4.2706 3.7467 3.9182 3.9412 3.9467 3.6619 3.5875 3.9237 3.9183 3.9040 3.8987 4.2629 4.2628 1.0257 1.0371 1.0079 1.0051 1.0171 1.0052 1.0040 1.0083 1.0158 1.0136 0.9933 0.9988 1.0112 0.9976 1.0006 1.0116 0.9999 1.0097 1.0191 1.0073 1.0191 1.0114 1.0081 1.0114 1.0093
dispcorr: -0.025205057 hartree
energy: -1094.876739714394
dipole: 18.94289 -19.08706 -0.14417 -15.39399 15.07916 -0.31483 18.77417 -17.72260 1.05157
magnitude: 1.10711 au
magnitude: 2.81405 debye
