program: Orca
programVersion: 5.0.3
elementType: Cl F F F F F F F O O C C C C C C C C C C C C C C C C C H H H H H H H H H H H H H H
charge: 0
multiplicity: 1
keywords: wb97x-d3
keywords: def2-TZVPP
keywords: def2/J RIJCOSX
keywords: DEFGRID2
keywords: scfconv7
keywords: smallprint printgap noloewdin
keywords: NOSOSCF
formula: C17H14ClF7O2
InChI: InChI=1/C17H14ClF7O2/c1-6-11(19)13(21)7(14(22)12(6)20)5-27-15(26)10-8(16(10,2)3)4-9(18)17(23,24)25/h4,8,10H,5H2,1-3H3
41 atoms
Cl -1.575886 1.10102 1.339243
F  -2.004281 3.261764 -0.728667
F  -1.596552 2.014177 -2.433824
F  -0.07043 2.36171 -0.955981
F  3.190889 -1.395225 -1.336244
F  0.958652 -0.633479 2.730193
F  1.455927 1.960846 2.51815
F  3.742977 1.190119 -1.514246
O  0.264634 -2.735267 0.923523
O  -0.06874 -1.884688 -1.11486
C  -3.063975 -2.628473 -0.684512
C  -2.878461 -1.271064 -0.103051
C  -1.933993 -2.40427 0.301445
C  -2.806284 -2.888716 -2.147146
C  -4.209853 -3.447309 -0.137668
C  -2.388651 -0.12883 -0.897507
C  -0.514078 -2.312943 -0.075877
C  -1.842219 0.952817 -0.358871
C  1.675931 -2.558182 0.788961
C  -1.379914 2.148527 -1.127379
C  2.04296 -1.104587 0.698077
C  2.758356 -0.586493 -0.367358
C  1.63702 -0.201809 1.66627
C  1.902672 1.148503 1.557416
C  3.040851 0.761497 -0.461462
C  2.608862 1.672564 0.488036
C  2.900415 3.13459 0.365118
H  -3.553953 -0.988544 0.69909
H  -2.102032 -2.797156 1.296702
H  -2.009417 -2.29083 -2.580075
H  -2.554115 -3.938458 -2.30338
H  -3.716369 -2.682753 -2.713052
H  -5.12682 -3.235149 -0.689863
H  -4.001687 -4.514065 -0.232904
H  -4.397234 -3.23483 0.915226
H  -2.51002 -0.157229 -1.973646
H  2.052358 -3.11633 -0.067313
H  2.099638 -3.009033 1.684343
H  2.873457 3.459614 -0.672663
H  2.181264 3.733496 0.917957
H  3.89209 3.364194 0.75713
elementType: Cl F O C H
totalener: -1965.97664571 hartree
nucrepener: 3067.31591038 hartree
electener: -5033.29255609 hartree
oneelecener: -8816.42721769 hartree
twoeener: 3783.13466159 hartree
cpcmener: -0.02501149 hartree
kineticenergy: 1959.83395211 hartree
xcener: -152.605546922959 hartree
chargesum: 0.0000000
charge: -0.072675 -0.174321 -0.169868 -0.162614 -0.208758 -0.203410 -0.208483 -0.210253 -0.282532 -0.479317 0.112590 -0.078388 -0.084704 -0.286099 -0.256904 -0.084319 0.409399 -0.065492 0.065782 0.504137 -0.140795 0.266282 0.180891 0.203124 0.234954 -0.147571 -0.216275 0.123254 0.099338 0.092420 0.102748 0.102983 0.096336 0.099216 0.090334 0.153022 0.122610 0.138616 0.107453 0.104544 0.122742
qa: -0.0727 -0.1743 -0.1699 -0.1626 -0.2088 -0.2034 -0.2085 -0.2103 -0.2825 -0.4793 0.1126 -0.0784 -0.0847 -0.2861 -0.2569 -0.0843 0.4094 -0.0655 0.0658 0.5041 -0.1408 0.2663 0.1809 0.2031 0.2350 -0.1476 -0.2163 0.1233 0.0993 0.0924 0.1027 0.1030 0.0963 0.0992 0.0903 0.1530 0.1226 0.1386 0.1075 0.1045 0.1227
va: 1.2714 1.1267 1.1355 1.1217 1.0879 1.0872 1.0832 1.0893 2.1230 2.0117 3.7921 3.8621 3.8822 3.8956 3.8986 3.7793 4.0615 3.9410 3.8470 4.4695 3.5937 3.8650 3.9400 3.8821 3.9359 3.6756 3.9118 1.0111 1.0310 1.0170 0.9998 0.9986 1.0023 1.0019 1.0043 1.0038 1.0163 0.9916 1.0035 1.0079 0.9955
dispcorr: -0.024742019 hartree
energy: -1966.001387728114
dipole: -19.08236 18.07063 -1.01173 -27.80986 26.42772 -1.38214 -4.87172 5.44376 0.57205
magnitude: 1.80586 au
magnitude: 4.59014 debye
