program: Orca
programVersion: 5.0.3
elementType: Cl F F F F F F F O O C C C C C C C C C C C C C C C C C H H H H H H H H H H H H H H
charge: 0
multiplicity: 1
keywords: wb97x-d3
keywords: def2-TZVPP
keywords: def2/J RIJCOSX
keywords: DEFGRID2
keywords: scfconv7
keywords: smallprint printgap noloewdin
keywords: NOSOSCF
formula: C17H14ClF7O2
InChI: InChI=1/C17H14ClF7O2/c1-6-11(19)13(21)7(14(22)12(6)20)5-27-15(26)10-8(16(10,2)3)4-9(18)17(23,24)25/h4,8,10H,5H2,1-3H3
41 atoms
Cl -1.547302 1.071471 1.328237
F  -0.093908 2.313955 -1.010964
F  -1.99736 3.255209 -0.705477
F  -1.678832 2.01493 -2.435885
F  3.127283 -1.351079 -1.396897
F  0.984143 -0.637084 2.725116
F  1.534739 1.952036 2.561085
F  3.740909 1.222436 -1.522909
O  0.246248 -2.713862 0.897453
O  -0.118861 -1.86186 -1.134467
C  -3.103196 -2.632134 -0.667717
C  -2.922644 -1.274156 -0.087353
C  -1.962733 -2.397909 0.304386
C  -2.860906 -2.886341 -2.13407
C  -4.234267 -3.462897 -0.108277
C  -2.45013 -0.129494 -0.88892
C  -0.548284 -2.293974 -0.090458
C  -1.872459 0.94069 -0.360978
C  1.654597 -2.538071 0.739592
C  -1.413406 2.132604 -1.136579
C  2.029867 -1.085386 0.667249
C  2.735125 -0.55672 -0.399646
C  1.657804 -0.196601 1.661876
C  1.957122 1.148699 1.581887
C  3.053694 0.785361 -0.46396
C  2.676817 1.67941 0.524564
C  3.004134 3.136775 0.44133
H  -3.590482 -0.996116 0.722784
H  -2.113914 -2.794262 1.300814
H  -2.595178 -3.931692 -2.296394
H  -3.781117 -2.692262 -2.687711
H  -2.079046 -2.275556 -2.575891
H  -4.405716 -3.259809 0.949297
H  -5.161338 -3.25222 -0.643814
H  -4.02103 -4.527457 -0.215202
H  -2.607717 -0.148472 -1.96054
H  2.014126 -3.083126 -0.132311
H  2.094265 -3.004419 1.619451
H  3.056813 3.590344 1.428062
H  3.961037 3.302751 -0.048421
H  2.24278 3.670923 -0.128509
elementType: Cl F O C H
totalener: -1965.97689344 hartree
nucrepener: 3062.35420853 hartree
electener: -5028.33110197 hartree
oneelecener: -8806.51351099 hartree
twoeener: 3778.18240902 hartree
cpcmener: -0.02510654 hartree
kineticenergy: 1959.83416105 hartree
xcener: -152.605495762981 hartree
chargesum: -0.0000000
charge: -0.072546 -0.164819 -0.174445 -0.169831 -0.208491 -0.203130 -0.208832 -0.210002 -0.282273 -0.478964 0.111616 -0.075041 -0.089065 -0.285977 -0.257410 -0.086857 0.409701 -0.062683 0.066420 0.506871 -0.134125 0.269883 0.168535 0.210756 0.231590 -0.151075 -0.207983 0.123915 0.098936 0.102822 0.102781 0.092413 0.090417 0.096575 0.099016 0.153170 0.122740 0.139252 0.105586 0.108608 0.111946
qa: -0.0725 -0.1648 -0.1744 -0.1698 -0.2085 -0.2031 -0.2088 -0.2100 -0.2823 -0.4790 0.1116 -0.0750 -0.0891 -0.2860 -0.2574 -0.0869 0.4097 -0.0627 0.0664 0.5069 -0.1341 0.2699 0.1685 0.2108 0.2316 -0.1511 -0.2080 0.1239 0.0989 0.1028 0.1028 0.0924 0.0904 0.0966 0.0990 0.1532 0.1227 0.1393 0.1056 0.1086 0.1119
va: 1.2716 1.1218 1.1269 1.1357 1.0882 1.0870 1.0829 1.0886 2.1238 2.0121 3.7887 3.8644 3.8817 3.8957 3.8994 3.7843 4.0623 3.9406 3.8439 4.4673 3.5842 3.8664 3.9504 3.8779 3.9308 3.6851 3.9083 1.0107 1.0314 0.9999 0.9986 1.0166 1.0042 1.0022 1.0019 1.0034 1.0171 0.9913 1.0062 1.0039 1.0019
dispcorr: -0.024594506 hartree
energy: -1966.001487947350
dipole: -19.13278 18.11463 -1.01814 -27.78506 26.40161 -1.38345 -4.50691 5.09975 0.59285
magnitude: 1.81714 au
magnitude: 4.61881 debye
