program: Gaussian 09
title: 000068037
version: EM64L-G09RevD.01
frameworkgroup: C1[X(C3H3N3O2)]
method: RPBEPBE
basis: SDD
operation: Freq
keyword: #pfreq=noraman
keyword: PBEPBE/SDD
title: #p freq=noraman PBEPBE/SDD
converged: NO NO NO NO
title: Mulliken charges:
elementType: O O N N N C C C H H H
charge: -0.231694 -0.209067 -0.388173 -0.405757 0.091951 0.244782 0.195770 -0.317946 0.372296 0.371615 0.276221
chargesum: 0.00000
title: Mulliken charges with hydrogens summed into heavy atoms:
elementType: O O N N N C C C
charge: -0.231694 -0.209067 -0.015876 -0.034141 0.091951 0.244782 0.195770 -0.041725
polarizability: 8.76229370e+01 -3.44021671e-02 5.91968439e+01 -7.83341501e-03 2.78569524e-03 2.47109409e+01
1716.lowfreq: -0.0008 0.0004 0.0009 10.7793 14.6425 16.7084 157.9466 172.6366 354.9861
frequency: 157.9327 172.6317 354.9860 424.7063 493.5957 508.3908 532.9745 676.8026 694.9457 707.9729 718.3501 777.5373 859.4991 936.7042 963.7938 1069.9682 1197.6530 1309.3072 1320.4393 1361.2491 1416.7150 1540.5848 1639.0309 1684.1520 3201.0289 3513.8088 3572.9831
redmass: 7.0531 5.6190 12.1944 6.5569 6.2816 8.4819 8.9988 1.6805 2.3786 12.5538 1.9439 1.8854 1.4270 3.2675 5.2308 5.2261 5.2379 1.3781 5.3541 1.8240 1.5151 5.2066 6.9205 5.8555 1.0936 1.0775 1.0798
irintensity: 4.6273 1.0357 21.7654 1.2874 4.6377 22.8210 14.3474 40.1443 0.1790 5.9717 95.1277 154.3752 35.1200 15.4285 12.3706 21.3894 51.5153 20.9358 124.8546 11.3724 2.3959 13.6901 357.1729 526.4695 0.3457 57.7282 92.8867
temp: 298.150 k
press: 1.00000 atm
elementType: 8 8 7 7 7 6 6 6 1 1 1
symmnumber: 1
zpe: 190252.6 jmol-1
zpe.correction: 0.072463 hartree
zpe.thermalcorrener: 0.078600 hartree
zpe.thermalcorrenthalpy: 0.079544 hartree
zpe.thermalcorrgfe: 0.042029 hartree
zpe.sumelectzpe: -430.239177 hartree
zpe.sumelectthermal: -430.233040 hartree
zpe.sumelectthermalent: -430.232096 hartree
zpe.sumelectthermalfe: -430.269611 hartree
dipole: 0.7355 1.6377 0.0002
dipole: 1.7952
quadrupole: -56.2425 -44.9256 -45.1969
quadrupole: 1.4710 0.0015 -0.0003
quadrupole: -7.4542 3.8627 3.5915 1.4710 0.0015 -0.0003
hfenergy: -430.3116404 hartree
pointgroup: C01 [X(C3H3N3O2)]
dipole: -0.2720278 0.6518194 -0.0000644 debye
dipolederiv: -1.1699915 -0.2932409 0.0000385 -0.4350956 -0.6715942 0.0000325 0.0002506 0.0001146 -0.3826533 -1.0045371 0.18046 0.0000292 0.4305475 -0.6087319 -0.0000166 0.0000546 -0.0000112 -0.3694405 -1.3303416 0.0593268 0.0001225 -0.0578541 -0.3508618 -0.0000102 0.0000547 -0.000003 -0.3638835 -0.7179666 0.0878095 0.0000313 -0.8376092 -0.6473063 0.0001543 0.0000886 -0.0000443 -0.3269353 0.8033498 -0.0832624 -0.0000923 0.3442493 -0.1439108 -0.0000425 -0.0001711 0.0000174 -0.1059781 1.6800614 0.1475249 -0.0000923 0.5490416 1.2695151 -0.0000978 -0.0002251 -0.0000882 0.3993418 1.504985 -0.1202562 -0.0000772 -0.3178015 0.8440319 -0.0000089 -0.0000981 -0.0000246 0.3570902 -0.1884519 0.1158031 -0.0000087 0.4370566 -0.2069952 -0.0000443 0.00002 0.0000088 -0.0851885 0.1488187 -0.0077727 0.000014 -0.0014699 0.226757 0.0000104 0.0000096 0.000013 0.3527241 0.2351446 -0.0502301 0.000018 -0.0980606 0.2201943 0.0000141 0.0000101 0.0000036 0.3657213 0.0389292 -0.036162 0.0000169 -0.0130041 0.0689019 0.0000089 0.0000061 0.0000139 0.1592019 unknown
polarizability: 87.6044426|-0.7256488|59.2153384|-0.0079051|-0.0025752|24.7109409 unknown
InChI: InChI=1S/C3H3N3O2/c7-2-1-4-6-3(8)5-2/h1,5-6H
charge 0 multiplicity 1
11 atoms
O  -2.375916 -0.967403 0.000387
O  2.330837 -1.084838 -0.000201
N  -0.016024 -1.040439 0.000054
N  -1.13058 1.023148 0.000058
N  0.043672 1.751875 -0.000136
C  -1.265498 -0.384162 0.000055
C  1.262555 -0.417328 -0.000099
C  1.175931 1.062108 -0.00025
H  -0.0460 -2.066305 0.000158
H  -1.988624 1.576818 0.000175
H  2.105348 1.634925 -0.0004
