program: Orca
programVersion: 5.0.3
elementType: Cl F F F F F F F O O C C C C C C C C C C C C C C C C C H H H H H H H H H H H H H H
charge: 0
multiplicity: 1
keywords: wb97x-d3
keywords: def2-TZVPP
keywords: def2/J RIJCOSX
keywords: DEFGRID2
keywords: scfconv7
keywords: smallprint printgap noloewdin
keywords: NOSOSCF
formula: C17H14ClF7O2
InChI: InChI=1/C17H14ClF7O2/c1-6-11(19)13(21)7(14(22)12(6)20)5-27-15(26)10-8(16(10,2)3)4-9(18)17(23,24)25/h4,8,10H,5H2,1-3H3
41 atoms
Cl -1.700892 1.147778 1.306994
F  -2.191164 3.243257 -0.816338
F  -1.687992 1.981587 -2.485107
F  -0.211551 2.42514 -0.982106
F  3.350053 -1.394929 -1.303228
F  0.857477 -0.591438 2.601268
F  1.441985 1.994704 2.440837
F  4.005549 1.170307 -1.407368
O  0.280961 -2.716365 0.879483
O  -0.093285 -1.860764 -1.147613
C  -3.068669 -2.666308 -0.673616
C  -2.896905 -1.299453 -0.107477
C  -1.930207 -2.413435 0.29445
C  -2.820816 -2.937552 -2.135942
C  -4.19886 -3.493598 -0.106062
C  -2.430784 -0.158371 -0.916646
C  -0.51596 -2.299939 -0.106053
C  -1.935085 0.953974 -0.391561
C  1.686328 -2.534717 0.723072
C  -1.506758 2.151846 -1.177173
C  2.066101 -1.082083 0.646061
C  2.870845 -0.579924 -0.361427
C  1.617321 -0.171743 1.589765
C  1.932042 1.170109 1.512215
C  3.21006 0.758543 -0.416994
C  2.747555 1.674897 0.512405
C  3.084697 3.130019 0.427789
H  -3.570062 -1.02042 0.698088
H  -2.076146 -2.800376 1.295688
H  -2.022042 -2.34681 -2.57494
H  -2.571464 -3.989206 -2.28638
H  -3.73193 -2.733303 -2.701656
H  -3.979741 -4.559412 -0.189433
H  -4.380918 -3.272238 0.946564
H  -5.124883 -3.300039 -0.650692
H  -2.531092 -0.212475 -1.993796
H  2.049721 -3.083544 -0.145755
H  2.125699 -2.996659 1.606747
H  3.15504 3.582809 1.414498
H  4.034715 3.2924 -0.076245
H  2.317865 3.669581 -0.130279
elementType: Cl F O C H
totalener: -1965.98924287 hartree
nucrepener: 3042.86447200 hartree
electener: -5008.85371487 hartree
oneelecener: -8767.31027731 hartree
twoeener: 3758.45656244 hartree
cpcmener: -0.02082502 hartree
kineticenergy: 1959.81583596 hartree
xcener: -152.600695542043 hartree
chargesum: -0.0000000
charge: -0.072441 -0.173478 -0.169610 -0.165491 -0.206464 -0.201045 -0.206756 -0.208559 -0.278133 -0.452585 0.110542 -0.084238 -0.076345 -0.285471 -0.254736 -0.079393 0.387313 -0.069316 0.064284 0.505004 -0.128693 0.260050 0.178795 0.208231 0.236229 -0.158694 -0.207568 0.119762 0.097573 0.094480 0.100764 0.101957 0.098947 0.088729 0.095906 0.148575 0.122369 0.135001 0.106379 0.105686 0.112437
qa: -0.0724 -0.1735 -0.1696 -0.1655 -0.2065 -0.2010 -0.2068 -0.2086 -0.2781 -0.4526 0.1105 -0.0842 -0.0763 -0.2855 -0.2547 -0.0794 0.3873 -0.0693 0.0643 0.5050 -0.1287 0.2600 0.1788 0.2082 0.2362 -0.1587 -0.2076 0.1198 0.0976 0.0945 0.1008 0.1020 0.0989 0.0887 0.0959 0.1486 0.1224 0.1350 0.1064 0.1057 0.1124
va: 1.2702 1.1273 1.1356 1.1238 1.0914 1.0900 1.0875 1.0902 2.1262 2.0408 3.7974 3.8640 3.8730 3.8964 3.8977 3.7827 4.0925 3.9495 3.8566 4.4732 3.5857 3.8922 3.9370 3.8947 3.9188 3.7098 3.9090 1.0120 1.0307 1.0178 1.0004 0.9986 1.0021 1.0045 1.0024 1.0063 1.0163 0.9912 1.0042 1.0069 1.0010
dispcorr: -0.024072983 hartree
energy: -1966.013315856209
dipole: -18.25477 17.38170 -0.87307 -28.30490 26.88620 -1.41870 -4.33775 4.89710 0.55935
magnitude: 1.75722 au
magnitude: 4.46650 debye
