program: Gaussian 09
title: 000068118
version: EM64L-G09RevD.01
frameworkgroup: C1[X(C21H36O2)]
method: RPBEPBE
basis: SDD
operation: Freq
keyword: #pfreq=noraman
keyword: PBEPBE/SDD
title: #p freq=noraman PBEPBE/SDD
converged: YES YES NO NO
title: Mulliken charges:
elementType: O O C C C C C C C C C C C C C C C C C C C C C H H H H H H H H H H H H H H H H H H H H H H H H H H H H H H H H H H H H
charge: -0.397370 -0.412946 -0.385237 -0.385050 -0.375857 -0.386908 -0.389964 -0.384360 -0.395881 -0.382595 -0.396321 -0.372409 -0.401176 -0.353652 -0.624899 -0.356540 0.445021 -0.696945 -0.036441 -0.442582 0.180498 -0.224320 -0.384592 0.198734 0.193176 0.194505 0.192304 0.191220 0.192104 0.193136 0.196508 0.189909 0.203281 0.193519 0.191922 0.199752 0.194008 0.191507 0.193052 0.195735 0.204386 0.189594 0.188554 0.221775 0.225396 0.188134 0.187286 0.208337 0.234514 0.194938 0.194246 0.209468 0.209902 0.214604 0.232834 0.222898 0.218009 0.359204 0.352073
chargesum: 0.00000
title: Mulliken charges with hydrogens summed into heavy atoms:
elementType: O O C C C C C C C C C C C C C C C C C C C C C
charge: -0.038166 -0.060873 0.006673 0.001759 0.007467 0.002736 0.003227 0.001082 -0.002122 0.001964 0.003799 0.005739 0.045995 0.021768 -0.182048 0.032644 0.445021 -0.062970 -0.036441 -0.209749 0.180498 -0.001422 -0.166582
polarizability: 3.00566691e+02 1.42358179e+00 2.44328789e+02 -1.12386063e-01 1.02332467e+01 1.67340803e+02
1716.lowfreq: -5.9548 -0.0019 -0.0004 0.0019 2.3970 7.4589 9.3309 11.2496 22.2862
frequency: 8.4444 10.4114 22.1862 24.4411 34.8784 43.9135 54.6619 62.0249 66.4854 85.5425 91.2596 94.3807 125.8663 126.6031 136.8237 150.4143 153.5605 160.7467 167.6510 194.3472 212.7896 237.4812 250.3577 256.9349 295.9505 308.3340 313.8922 315.8805 321.3100 331.3795 354.1511 389.9271 417.0716 458.7460 475.1642 487.4710 503.3342 516.0694 534.3444 555.1202 592.0291 677.8483 712.5065 720.2849 721.2674 726.0667 730.4012 737.9608 757.0840 772.4798 782.0831 812.3936 817.9239 843.4574 854.6765 876.0841 887.7845 888.3800 924.3903 940.8884 941.7941 966.5727 976.5837 982.3837 997.5431 1006.6618 1017.2585 1031.0077 1042.1453 1048.2991 1063.1738 1068.7303 1077.8487 1079.6697 1080.9175 1095.2074 1105.6008 1114.9864 1121.5735 1139.3947 1143.2214 1162.6725 1179.6892 1180.8529 1196.8015 1201.3957 1218.9772 1227.6885 1233.1916 1240.8901 1253.5186 1258.4630 1267.4462 1271.2168 1276.4193 1279.7022 1281.9877 1286.3176 1289.9167 1295.6553 1297.2342 1298.5463 1300.0135 1303.2454 1309.8672 1328.6928 1341.8318 1346.3079 1348.1457 1352.5120 1354.4906 1355.3201 1357.3033 1389.0710 1405.2579 1458.0843 1458.2340 1459.5563 1460.3830 1461.3263 1461.8787 1464.1118 1465.8621 1469.6971 1474.5423 1477.6458 1478.1446 1479.4914 1483.8814 1487.2063 1488.4477 1489.7717 1502.8983 1590.9232 1637.8670 2946.0134 2946.9402 2948.0994 2948.5906 2949.5496 2950.5413 2951.2715 2954.5157 2957.4113 2960.2062 2963.6649 2964.7722 2967.6064 2971.2542 2981.1502 2982.3606 2985.1170 2987.1137 2990.3509 2996.7994 3003.1776 3011.4626 3017.0608 3021.7947 3024.1789 3030.1825 3037.1920 3043.1921 3048.4157 3067.9589 3069.9306 3113.3940 3128.9710 3160.7830 3568.0371 3575.5142
redmass: 4.9740 5.3789 4.1692 2.7931 1.9106 3.9431 2.4813 2.0360 4.0847 3.1092 2.9024 1.7433 1.7765 2.4414 3.2942 1.9867 2.0967 3.5020 5.2048 2.5732 3.1129 1.1048 3.6237 2.4781 3.5216 1.2965 2.8206 2.5577 2.7060 2.6974 1.4750 2.9417 2.9991 3.0121 3.8334 2.8502 3.1976 3.7428 4.1302 4.2798 5.6544 4.6764 1.1555 1.0580 1.0712 1.1053 1.7732 1.1390 1.1890 2.4262 1.2552 1.7982 2.6568 1.3601 1.4885 1.8836 1.8883 1.5797 1.7949 1.5429 1.4074 2.6367 1.6734 2.7161 2.9527 1.7708 2.5223 1.1862 2.8172 2.7286 2.2238 2.6855 2.0933 2.2289 2.1612 2.0032 2.4852 1.5550 2.2921 1.3665 1.5826 1.2573 1.8279 1.9134 1.4641 1.4315 1.4261 1.3930 1.8244 1.3730 1.3259 1.3071 1.5888 1.2062 1.0372 1.1538 1.2540 1.1320 1.0859 1.1623 1.1058 1.7609 1.1854 1.3940 1.3155 1.4075 1.5006 1.4365 1.4599 1.7316 1.6119 1.6500 1.5473 1.2175 6.1978 1.1127 1.0764 2.1745 1.0941 1.1085 1.0899 1.0851 1.0849 1.0847 1.0876 1.2739 1.0428 1.0900 1.0917 1.0945 1.0944 1.8785 1.2248 6.6688 6.4512 1.0670 1.0589 1.0585 1.0588 1.0593 1.0591 1.0595 1.0596 1.0599 1.0592 1.0603 1.0621 1.0585 1.0366 1.0953 1.0942 1.0918 1.0717 1.0971 1.1001 1.1018 1.1019 1.1003 1.0959 1.1019 1.1043 1.1046 1.1045 1.1009 1.1007 1.0993 1.0885 1.0895 1.0985 1.0652 1.0660
irintensity: 0.2199 0.3893 0.0703 0.0342 0.0036 0.3014 0.0917 0.1144 0.3893 0.2381 0.1561 0.0561 0.0289 0.0551 0.1134 0.0088 0.0184 0.0198 0.4159 0.6596 0.5430 0.0003 2.9952 3.3519 15.9247 81.7062 11.6592 12.5930 7.5683 38.0290 102.4118 0.0342 0.0142 0.1089 2.1846 0.3088 2.2688 5.6707 0.5734 0.2568 0.2690 4.4315 12.6956 19.2186 0.3610 3.7088 54.3787 3.3188 1.2303 33.7106 0.1631 17.4804 13.4616 0.7452 0.5252 1.0035 4.7847 2.0900 16.3535 21.1290 7.4407 4.1178 5.8231 0.1995 0.2328 5.0073 1.4751 0.9989 4.1503 4.0279 6.2762 0.1735 0.3743 0.1292 0.6810 14.6840 2.4145 2.4830 19.2995 341.7090 21.3891 19.6004 52.9247 3.2549 14.0063 13.0638 1.8367 0.8212 10.4498 0.7369 0.6593 2.1489 12.2688 0.0875 0.1194 1.6390 2.6010 0.4458 0.2047 1.8831 0.5986 15.4830 2.3763 3.0122 0.9324 0.1170 0.4661 4.5064 0.3922 1.0072 0.7882 0.4949 1.9797 11.3390 11.5428 1.2504 0.3326 20.7405 9.8921 2.1745 0.7834 0.0111 1.0808 1.0417 2.7592 12.2153 12.2453 1.4783 1.3911 3.1558 45.7262 54.9085 16.1124 30.9589 11.9215 17.5164 5.8151 0.2225 1.5649 2.2572 0.8255 1.0165 2.1183 23.8783 5.8230 50.1449 144.6659 217.7170 36.9990 0.9550 6.4305 6.8208 9.8528 1.1018 2.1362 4.5467 16.3008 21.7110 4.7588 10.3292 57.5273 6.5779 367.6390 73.3238 98.2138 55.9625 12.6896 14.1354 23.1520 52.6145 27.0611
temp: 298.150 k
press: 1.00000 atm
elementType: 8 8 6 6 6 6 6 6 6 6 6 6 6 6 6 6 6 6 6 6 6 6 6 1 1 1 1 1 1 1 1 1 1 1 1 1 1 1 1 1 1 1 1 1 1 1 1 1 1 1 1 1 1 1 1 1 1 1 1
symmnumber: 1
zpe: 1375060.0 jmol-1
zpe.correction: 0.523733 hartree
zpe.thermalcorrener: 0.551559 hartree
zpe.thermalcorrenthalpy: 0.552503 hartree
zpe.thermalcorrgfe: 0.459417 hartree
zpe.sumelectzpe: -970.432951 hartree
zpe.sumelectthermal: -970.405125 hartree
zpe.sumelectthermalent: -970.404181 hartree
zpe.sumelectthermalfe: -970.497267 hartree
dipole: -1.2850 -1.4623 -0.0398
dipole: 1.9471
quadrupole: -131.2035 -132.7785 -147.9268
quadrupole: -3.7062 -0.9331 1.6494
quadrupole: 6.0995 4.5244 -10.6239 -3.7062 -0.9331 1.6494
hfenergy: -970.9566836 hartree
pointgroup: C01 [X(C21H36O2)]
dipole: -0.4852001 0.5927703 0.0053131 debye
polarizability: 300.4013121|-3.3233187|244.9030992|-0.1472116|8.5585051|166.9318718 unknown
InChI: InChI=1S/C21H36O2/c1-2-3-4-5-6-7-8-9-10-11-12-13-14-16-19-17-15-18-20(22)21(19)23/h15,17-18,22-23H,2-14,16H2,1H3
charge 0 multiplicity 1
59 atoms
O  -3.049414 -1.124318 0.219228
O  -4.205835 -3.520237 -0.208098
C  1.510466 1.445946 -0.470562
C  2.847158 1.373823 0.301631
C  0.435721 2.291557 0.249027
C  3.932087 0.547771 -0.425336
C  -0.91376 2.340107 -0.502876
C  5.25921 0.455579 0.361124
C  -1.978702 3.197395 0.22102
C  6.352239 -0.355121 -0.371083
C  -3.331241 3.311224 -0.529189
C  7.67347 -0.458474 0.424152
C  -4.098756 1.978906 -0.715065
C  8.772233 -1.258973 -0.310813
C  -4.594742 1.352585 0.62228
C  10.09098 -1.365428 0.488947
C  -5.255943 -0.003901 0.426823
C  11.185271 -2.162205 -0.254097
C  -4.455799 -1.159774 0.217682
C  -6.66743 -0.138437 0.409199
C  -5.062496 -2.424653 -0.009896
C  -7.273975 -1.390921 0.182637
C  -6.470544 -2.534208 -0.028127
H  1.123581 0.417575 -0.628709
H  1.692695 1.867857 -1.481173
H  2.665142 0.935609 1.305417
H  3.226482 2.402739 0.476247
H  0.813936 3.326289 0.386491
H  0.272293 1.884496 1.269372
H  4.127322 0.995619 -1.422354
H  3.546983 -0.476003 -0.615025
H  -1.280166 1.301612 -0.646891
H  -0.753088 2.745796 -1.523608
H  5.064625 -0.004435 1.352715
H  5.637448 1.479846 0.563306
H  -1.568693 4.218092 0.363621
H  -2.140317 2.795924 1.243334
H  6.55468 0.110705 -1.358385
H  5.971148 -1.376298 -0.58236
H  -3.984466 4.027616 0.011177
H  -3.14416 3.753641 -1.528984
H  7.471649 -0.931825 1.408038
H  8.049939 0.563031 0.643053
H  -4.98382 2.154976 -1.356436
H  -3.470915 1.251839 -1.266291
H  8.396635 -2.279916 -0.533234
H  8.97869 -0.783901 -1.292935
H  -3.748087 1.284591 1.339406
H  -5.316156 2.04871 1.08943
H  9.884363 -1.842921 1.468626
H  10.463084 -0.344741 0.713718
H  11.43042 -1.688276 -1.223511
H  10.849583 -3.195733 -0.462794
H  12.117216 -2.222588 0.337897
H  -7.286639 0.750623 0.575221
H  -8.364697 -1.483858 0.171752
H  -6.935061 -3.51346 -0.204778
H  -2.73288 -0.212081 0.437958
H  -4.737966 -4.342795 -0.349417
