program: Orca
programVersion: 5.0.3
elementType: Cl F F F F F F F O O C C C C C C C C C C C C C C C C C H H H H H H H H H H H H H H
charge: 0
multiplicity: 1
keywords: wb97x-d3
keywords: def2-TZVPP
keywords: def2/J RIJCOSX
keywords: DEFGRID2
keywords: scfconv7
keywords: smallprint printgap noloewdin
keywords: NOSOSCF
formula: C17H14ClF7O2
InChI: InChI=1/C17H14ClF7O2/c1-6-11(19)13(21)7(14(22)12(6)20)5-27-15(26)10-8(16(10,2)3)4-9(18)17(23,24)25/h4,8,10H,5H2,1-3H3
41 atoms
Cl -5.251567 0.911621 0.721679
F  -4.014449 3.526063 1.44309
F  -4.503266 3.497627 -0.646708
F  -2.441576 3.477318 -0.027177
F  3.073194 1.005368 1.700076
F  2.450046 -3.348064 0.040502
F  3.953189 -2.746883 -2.077727
F  4.58267 1.589997 -0.385116
O  0.514778 -1.928496 1.661157
O  0.096395 0.180123 1.066628
C  -1.801217 -1.542904 -0.872578
C  -2.647683 -0.721808 0.066432
C  -1.502201 -1.557573 0.609213
C  -0.849758 -0.885527 -1.841279
C  -2.441514 -2.790202 -1.427167
C  -2.634175 0.741533 0.049524
C  -0.246801 -0.974177 1.125774
C  -3.685738 1.513971 0.299892
C  1.821897 -1.554662 2.100905
C  -3.653832 3.007475 0.263944
C  2.705338 -1.194167 0.941529
C  3.272933 0.05701 0.785586
C  2.965265 -2.121644 -0.055653
C  3.746842 -1.811185 -1.147655
C  4.065946 0.361429 -0.306869
C  4.323716 -0.560321 -1.306285
C  5.181091 -0.255103 -2.493506
H  -3.612795 -1.158877 0.292344
H  -1.809692 -2.457641 1.129185
H  -0.072474 -1.594126 -2.133238
H  -1.384553 -0.594343 -2.746553
H  -0.350998 0.000811 -1.456646
H  -1.684352 -3.535361 -1.676746
H  -3.13538 -3.242665 -0.718863
H  -2.996471 -2.561367 -2.337987
H  -1.713155 1.245149 -0.206365
H  2.205432 -2.433414 2.616343
H  1.768882 -0.746163 2.829332
H  4.647898 -0.450593 -3.423743
H  5.497052 0.78416 -2.50771
H  6.079842 -0.872842 -2.493079
elementType: Cl F O C H
totalener: -1965.99237336 hartree
nucrepener: 2814.02798838 hartree
electener: -4780.02036174 hartree
oneelecener: -8308.43374449 hartree
twoeener: 3528.41338275 hartree
cpcmener: -0.02131776 hartree
kineticenergy: 1959.82338449 hartree
xcener: -152.602169023632 hartree
chargesum: -0.0000000
charge: -0.076251 -0.174265 -0.174917 -0.170998 -0.204686 -0.204316 -0.208053 -0.208357 -0.274824 -0.451760 0.080829 0.025382 -0.067614 -0.274101 -0.253631 -0.153239 0.389424 -0.084499 0.061902 0.510056 -0.187772 0.284978 0.210097 0.218083 0.238173 -0.155768 -0.207165 0.092541 0.106937 0.101023 0.108045 0.095296 0.096228 0.089867 0.097211 0.140608 0.140290 0.120978 0.111326 0.099424 0.113518
qa: -0.0763 -0.1743 -0.1749 -0.1710 -0.2047 -0.2043 -0.2081 -0.2084 -0.2748 -0.4518 0.0808 0.0254 -0.0676 -0.2741 -0.2536 -0.1532 0.3894 -0.0845 0.0619 0.5101 -0.1878 0.2850 0.2101 0.2181 0.2382 -0.1558 -0.2072 0.0925 0.1069 0.1010 0.1080 0.0953 0.0962 0.0899 0.0972 0.1406 0.1403 0.1210 0.1113 0.0994 0.1135
va: 1.2590 1.1242 1.1233 1.1327 1.0933 1.0922 1.0912 1.0892 2.1320 2.0488 3.8031 3.7878 3.8537 3.9048 3.9026 3.8557 4.1569 4.0001 3.8459 4.4854 3.6273 3.8670 3.9375 3.9287 3.8937 3.7348 3.9142 1.0299 1.0263 0.9983 1.0011 1.0137 1.0025 1.0055 1.0016 1.0307 0.9922 1.0187 0.9982 1.0139 0.9965
dispcorr: -0.020680428 hartree
energy: -1966.013053788432
dipole: 7.54623 -6.41446 1.13177 -24.21408 21.98635 -2.22773 -13.24975 12.57258 -0.67717
magnitude: 2.58887 au
magnitude: 6.58040 debye
