program: Orca
programVersion: 5.0.3
elementType: Cl F F F F F F F O O C C C C C C C C C C C C C C C C C H H H H H H H H H H H H H H
charge: 0
multiplicity: 1
keywords: wb97x-d3
keywords: def2-TZVPP
keywords: def2/J RIJCOSX
keywords: DEFGRID2
keywords: scfconv7
keywords: smallprint printgap noloewdin
keywords: NOSOSCF
formula: C17H14ClF7O2
InChI: InChI=1/C17H14ClF7O2/c1-6-11(19)13(21)7(14(22)12(6)20)5-27-15(26)10-8(16(10,2)3)4-9(18)17(23,24)25/h4,8,10H,5H2,1-3H3
41 atoms
Cl -5.207194 0.954769 0.573937
F  -4.456042 3.481686 -0.877854
F  -2.378418 3.452777 -0.31831
F  -3.906194 3.571166 1.195612
F  3.035778 0.958119 1.914532
F  2.365541 -3.306076 0.054262
F  3.863751 -2.638469 -2.031537
F  4.555919 1.616383 -0.164714
O  0.446423 -1.952078 1.725437
O  0.031555 0.171145 1.177296
C  -1.735599 -1.6141 -0.868409
C  -2.632488 -0.742955 -0.024853
C  -1.539631 -1.567208 0.628914
C  -0.709566 -1.006377 -1.792554
C  -2.348402 -2.880136 -1.413051
C  -2.597252 0.719007 -0.104502
C  -0.305461 -0.985896 1.197142
C  -3.637066 1.517471 0.114414
C  1.748431 -1.593969 2.190911
C  -3.586917 3.008832 0.023872
C  2.643396 -1.198425 1.051712
C  3.226147 0.054108 0.954132
C  2.893282 -2.081404 0.014756
C  3.679038 -1.733353 -1.0672
C  4.018985 0.394586 -0.123883
C  4.268423 -0.483919 -1.166298
C  5.132063 -0.077757 -2.318581
H  -3.616972 -1.158438 0.154586
H  -1.892437 -2.441632 1.164611
H  -1.175005 -0.744028 -2.743934
H  -0.227584 -0.110424 -1.407532
H  0.07687 -1.734028 -2.001457
H  -2.837908 -2.689804 -2.370019
H  -1.581802 -3.640125 -1.575465
H  -3.092941 -3.29783 -0.734492
H  -1.669249 1.197322 -0.385022
H  2.125743 -2.488293 2.684088
H  1.688075 -0.807862 2.942606
H  5.267303 -0.888294 -3.029167
H  4.694283 0.763843 -2.856275
H  6.120615 0.229109 -1.976391
elementType: Cl F O C H
totalener: -1965.99206002 hartree
nucrepener: 2824.00847385 hartree
electener: -4790.00053386 hartree
oneelecener: -8328.37172825 hartree
twoeener: 3538.37119439 hartree
cpcmener: -0.02171401 hartree
kineticenergy: 1959.80292776 hartree
xcener: -152.598043869357 hartree
chargesum: -0.0000000
charge: -0.076326 -0.175177 -0.170943 -0.174288 -0.205022 -0.204473 -0.209710 -0.206991 -0.272343 -0.446544 0.085553 0.020224 -0.061994 -0.279663 -0.254008 -0.152549 0.377849 -0.082412 0.059991 0.510318 -0.179354 0.286276 0.198340 0.246748 0.213480 -0.155710 -0.206303 0.092881 0.108295 0.111241 0.094049 0.101666 0.097600 0.096340 0.089661 0.138694 0.139944 0.120773 0.098622 0.113367 0.111901
qa: -0.0763 -0.1752 -0.1709 -0.1743 -0.2050 -0.2045 -0.2097 -0.2070 -0.2723 -0.4465 0.0856 0.0202 -0.0620 -0.2797 -0.2540 -0.1525 0.3778 -0.0824 0.0600 0.5103 -0.1794 0.2863 0.1983 0.2467 0.2135 -0.1557 -0.2063 0.0929 0.1083 0.1112 0.0940 0.1017 0.0976 0.0963 0.0897 0.1387 0.1399 0.1208 0.0986 0.1134 0.1119
va: 1.2591 1.1237 1.1329 1.1234 1.0934 1.0909 1.0863 1.0939 2.1308 2.0562 3.8045 3.7971 3.8409 3.9057 3.8985 3.8592 4.1750 3.9977 3.8512 4.4860 3.6232 3.8494 3.9517 3.8655 3.9522 3.7369 3.9146 1.0298 1.0256 1.0007 1.0135 0.9974 1.0013 1.0027 1.0054 1.0276 0.9923 1.0182 1.0139 0.9970 0.9974
dispcorr: -0.021056212 hartree
energy: -1966.013116227351
dipole: 7.93721 -6.77971 1.15751 -24.62340 22.39238 -2.23103 -12.12611 11.48629 -0.63983
magnitude: 2.59358 au
magnitude: 6.59237 debye
