program: Orca
programVersion: 5.0.3
elementType: Cl F F F F F F F O O C C C C C C C C C C C C C C C C C H H H H H H H H H H H H H H
charge: 0
multiplicity: 1
keywords: wb97x-d3
keywords: def2-TZVPP
keywords: def2/J RIJCOSX
keywords: DEFGRID2
keywords: scfconv7
keywords: smallprint printgap noloewdin
keywords: NOSOSCF
formula: C17H14ClF7O2
InChI: InChI=1/C17H14ClF7O2/c1-6-11(19)13(21)7(14(22)12(6)20)5-27-15(26)10-8(16(10,2)3)4-9(18)17(23,24)25/h4,8,10H,5H2,1-3H3
41 atoms
Cl -1.593396 1.125798 1.2913
F  -2.025245 3.257696 -0.79422
F  -1.684563 1.983445 -2.495389
F  -0.113187 2.322897 -1.064698
F  3.099935 -1.320253 -1.398789
F  1.005244 -0.660161 2.756896
F  1.548605 1.934025 2.617237
F  3.69753 1.260022 -1.506337
O  0.251375 -2.710432 0.905941
O  -0.11755 -1.872842 -1.130533
C  -3.098577 -2.641186 -0.645159
C  -2.914889 -1.271354 -0.0911
C  -1.957229 -2.38938 0.319811
C  -2.856377 -2.92405 -2.106363
C  -4.231334 -3.457775 -0.067808
C  -2.440783 -0.140934 -0.912088
C  -0.542542 -2.292703 -0.082165
C  -1.888605 0.950666 -0.400012
C  1.657915 -2.534813 0.74607
C  -1.430389 2.130109 -1.196519
C  2.030124 -1.080726 0.682944
C  2.717953 -0.53819 -0.388538
C  1.66464 -0.204265 1.691123
C  1.958538 1.143031 1.622874
C  3.028869 0.806307 -0.442658
C  2.66121 1.68772 0.560965
C  2.980111 3.147657 0.486758
H  -3.582999 -0.977082 0.713164
H  -2.104495 -2.767045 1.324337
H  -2.053583 -2.342594 -2.550728
H  -2.616638 -3.978596 -2.251809
H  -3.766919 -2.714956 -2.671258
H  -5.15816 -3.266472 -0.611738
H  -4.015969 -4.525162 -0.140996
H  -4.409082 -3.225419 0.983096
H  -2.57678 -0.188467 -1.985766
H  2.017625 -3.073386 -0.130168
H  2.099875 -3.007032 1.622331
H  3.940121 3.322911 0.005472
H  2.219908 3.67974 -0.087135
H  3.022038 3.598669 1.475432
elementType: Cl F O C H
totalener: -1965.98959576 hartree
nucrepener: 3056.22573061 hartree
electener: -5022.21532637 hartree
oneelecener: -8794.05211576 hartree
twoeener: 3771.83678939 hartree
cpcmener: -0.02086525 hartree
kineticenergy: 1959.82273341 hartree
xcener: -152.602073040437 hartree
chargesum: -0.0000000
charge: -0.071971 -0.173438 -0.169651 -0.164925 -0.206836 -0.202073 -0.207598 -0.208253 -0.277806 -0.452444 0.111244 -0.081892 -0.082928 -0.286273 -0.255681 -0.081401 0.389185 -0.066453 0.066819 0.506510 -0.146103 0.277269 0.177833 0.209184 0.228576 -0.153778 -0.207352 0.121126 0.097054 0.095163 0.100553 0.101962 0.095815 0.099055 0.088659 0.149329 0.120362 0.136491 0.108280 0.111663 0.104725
qa: -0.0720 -0.1734 -0.1697 -0.1649 -0.2068 -0.2021 -0.2076 -0.2083 -0.2778 -0.4524 0.1112 -0.0819 -0.0829 -0.2863 -0.2557 -0.0814 0.3892 -0.0665 0.0668 0.5065 -0.1461 0.2773 0.1778 0.2092 0.2286 -0.1538 -0.2074 0.1211 0.0971 0.0952 0.1006 0.1020 0.0958 0.0991 0.0887 0.1493 0.1204 0.1365 0.1083 0.1117 0.1047
va: 1.2699 1.1283 1.1358 1.1222 1.0907 1.0889 1.0847 1.0908 2.1263 2.0420 3.7889 3.8663 3.8738 3.8960 3.8988 3.7874 4.0945 3.9470 3.8506 4.4685 3.5998 3.8586 3.9472 3.8796 3.9317 3.6911 3.9094 1.0113 1.0314 1.0173 1.0005 0.9984 1.0025 1.0020 1.0045 1.0055 1.0179 0.9910 1.0035 1.0019 1.0070
dispcorr: -0.024465988 hartree
energy: -1966.014061750220
dipole: -18.93678 17.99866 -0.93812 -27.95146 26.59818 -1.35328 -4.02120 4.58156 0.56036
magnitude: 1.73938 au
magnitude: 4.42116 debye
