program: Orca
programVersion: 5.0.3
elementType: Cl F F F F F F F O O C C C C C C C C C C C C C C C C C H H H H H H H H H H H H H H
charge: 0
multiplicity: 1
keywords: wb97x-d3
keywords: def2-TZVPP
keywords: def2/J RIJCOSX
keywords: DEFGRID2
keywords: scfconv7
keywords: smallprint printgap noloewdin
keywords: NOSOSCF
formula: C17H14ClF7O2
InChI: InChI=1/C17H14ClF7O2/c1-6-11(19)13(21)7(14(22)12(6)20)5-27-15(26)10-8(16(10,2)3)4-9(18)17(23,24)25/h4,8,10H,5H2,1-3H3
41 atoms
Cl -2.578091 1.457732 2.05766
F  -1.280217 2.160139 -1.531421
F  -0.682671 3.010189 0.355051
F  -2.688919 3.285892 -0.357386
F  2.380946 -1.471274 2.054176
F  2.198519 -0.842434 -2.597218
F  2.525873 1.779147 -2.246521
F  2.736271 1.147251 2.399754
O  0.665969 -2.984392 0.152149
O  -0.323361 -1.999636 -1.589002
C  -3.009385 -2.4965 -0.162467
C  -2.450579 -1.300365 0.557037
C  -1.601458 -2.56469 0.359855
C  -3.32493 -2.455895 -1.638241
C  -4.012187 -3.316313 0.618467
C  -2.091078 -0.054051 -0.125864
C  -0.393039 -2.482612 -0.490344
C  -2.103225 1.154201 0.427049
C  1.945456 -2.700886 -0.416509
C  -1.68885 2.406454 -0.287644
C  2.254859 -1.237454 -0.276835
C  2.409669 -0.680043 0.98331
C  2.31059 -0.374057 -1.360366
C  2.490145 0.984544 -1.177718
C  2.594271 0.678069 1.160053
C  2.633079 1.54723 0.081129
C  2.818802 3.024506 0.238521
H  -2.786931 -1.171576 1.578813
H  -1.455389 -3.141048 1.265907
H  -2.636322 -1.863384 -2.230465
H  -3.313781 -3.467314 -2.046972
H  -4.329371 -2.054854 -1.781126
H  -3.786845 -3.337644 1.685396
H  -5.016786 -2.908097 0.499972
H  -4.025852 -4.347553 0.262199
H  -1.767682 -0.115072 -1.155756
H  1.993704 -3.016552 -1.457809
H  2.645976 -3.306625 0.155147
H  1.929109 3.560559 -0.088633
H  3.009165 3.295878 1.272288
H  3.655041 3.379794 -0.361884
totalener: -1965.97618761 hartree
nucrepener: 2994.01724411 hartree
electener: -4959.99343172 hartree
oneelecener: -8668.41097771 hartree
twoeener: 3708.41754600 hartree
kineticenergy: 1959.83624913 hartree
xcener: -152.600464420396 hartree
chargesum: 0.0000000
charge: -0.057774 -0.168976 -0.172712 -0.160025 -0.186521 -0.180658 -0.189183 -0.192168 -0.261211 -0.389726 0.069732 0.041935 -0.077081 -0.245968 -0.234166 -0.203283 0.349670 -0.081899 0.064421 0.525595 -0.247924 0.211437 0.306287 0.209747 0.244352 -0.194178 -0.195847 0.079136 0.091275 0.105090 0.088415 0.090702 0.075488 0.094481 0.092805 0.150165 0.117404 0.122592 0.104575 0.098326 0.105669
qa: -0.0578 -0.1690 -0.1727 -0.1600 -0.1865 -0.1807 -0.1892 -0.1922 -0.2612 -0.3897 0.0697 0.0419 -0.0771 -0.2460 -0.2342 -0.2033 0.3497 -0.0819 0.0644 0.5256 -0.2479 0.2114 0.3063 0.2097 0.2444 -0.1942 -0.1958 0.0791 0.0913 0.1051 0.0884 0.0907 0.0755 0.0945 0.0928 0.1502 0.1174 0.1226 0.1046 0.0983 0.1057
va: 1.2794 1.1354 1.1265 1.1489 1.1170 1.1255 1.1148 1.1099 2.1392 2.0949 3.7958 3.7625 3.8799 3.9009 3.9083 3.8860 4.1669 4.0409 3.8654 4.4392 3.6875 3.9697 3.8354 3.9350 3.8674 3.7566 3.9164 1.0366 1.0297 1.0210 1.0022 1.0011 1.0080 1.0043 1.0044 1.0271 1.0179 0.9935 1.0104 1.0145 1.0011
dispcorr: -0.022614284 hartree
energy: -1965.998801889843
dipole: -16.01803 15.79481 -0.22323 -27.87317 26.74339 -1.12978 -3.16409 3.50703 0.34294
magnitude: 1.20160 au
magnitude: 3.05422 debye
