program: Orca
programVersion: 5.0.3
elementType: Cl F F F F F F F O O C C C C C C C C C C C C C C C C C H H H H H H H H H H H H H H
charge: 0
multiplicity: 1
keywords: wb97x-d3
keywords: def2-TZVPP
keywords: def2/J RIJCOSX
keywords: DEFGRID2
keywords: scfconv7
keywords: smallprint printgap noloewdin
keywords: NOSOSCF
formula: C17H14ClF7O2
InChI: InChI=1/C17H14ClF7O2/c1-6-11(19)13(21)7(14(22)12(6)20)5-27-15(26)10-8(16(10,2)3)4-9(18)17(23,24)25/h4,8,10H,5H2,1-3H3
41 atoms
Cl -1.42136 1.131996 1.293039
F  -1.648595 1.872512 -2.511645
F  -0.066472 2.314821 -1.119179
F  -2.001608 3.20422 -0.85678
F  1.297751 -0.961777 2.571284
F  2.99866 -1.018034 -1.807056
F  3.479684 1.59479 -1.651847
F  1.725791 1.668515 2.701488
O  0.452028 -2.80341 0.609347
O  -0.163712 -1.920153 -1.349007
C  -3.065067 -2.667014 -0.51514
C  -2.77875 -1.305449 0.02249
C  -1.812577 -2.455688 0.304653
C  -3.003897 -2.945808 -1.996892
C  -4.153188 -3.448924 0.185549
C  -2.360743 -0.183454 -0.83927
C  -0.453213 -2.363485 -0.270433
C  -1.791558 0.920875 -0.375924
C  1.818968 -2.541986 0.310985
C  -1.377462 2.083213 -1.225011
C  2.123083 -1.071035 0.375725
C  1.824585 -0.342496 1.516946
C  2.679258 -0.376952 -0.685985
C  2.929302 0.981529 -0.603622
C  2.056314 1.016225 1.586571
C  2.620196 1.714053 0.530697
C  2.844804 3.192396 0.60952
H  -3.34167 -0.999013 0.898972
H  -1.837174 -2.841814 1.316471
H  -2.853377 -4.012247 -2.169649
H  -3.953263 -2.671101 -2.460269
H  -2.206356 -2.41987 -2.513266
H  -5.130616 -3.207294 -0.234899
H  -3.995664 -4.522226 0.069889
H  -4.19105 -3.233626 1.254119
H  -2.535635 -0.254172 -1.90456
H  2.093713 -2.951124 -0.660566
H  2.376539 -3.082375 1.074921
H  3.160637 3.49404 1.605632
H  3.602531 3.519867 -0.096964
H  1.923262 3.728116 0.379085
totalener: -1965.97431662 hartree
nucrepener: 3065.20754856 hartree
electener: -5031.18186518 hartree
oneelecener: -8811.21782885 hartree
twoeener: 3780.03596367 hartree
kineticenergy: 1959.85327618 hartree
xcener: -152.604442788817 hartree
chargesum: 0.0000000
charge: -0.055579 -0.164882 -0.160821 -0.163209 -0.185193 -0.189349 -0.193103 -0.192515 -0.258957 -0.378785 0.105991 -0.088235 -0.068266 -0.277486 -0.234697 -0.070992 0.332666 -0.081594 0.059992 0.507839 -0.200946 0.196805 0.304324 0.228651 0.177279 -0.165837 -0.201838 0.102402 0.087294 0.088595 0.096015 0.104539 0.092472 0.094524 0.075535 0.128793 0.116645 0.119830 0.103704 0.101258 0.107131
qa: -0.0556 -0.1649 -0.1608 -0.1632 -0.1852 -0.1893 -0.1931 -0.1925 -0.2590 -0.3788 0.1060 -0.0882 -0.0683 -0.2775 -0.2347 -0.0710 0.3327 -0.0816 0.0600 0.5078 -0.2009 0.1968 0.3043 0.2287 0.1773 -0.1658 -0.2018 0.1024 0.0873 0.0886 0.0960 0.1045 0.0925 0.0945 0.0755 0.1288 0.1166 0.1198 0.1037 0.1013 0.1071
va: 1.2876 1.1429 1.1282 1.1424 1.1111 1.1151 1.1086 1.1044 2.1344 2.1019 3.7781 3.8779 3.8654 3.9028 3.9000 3.8100 4.1603 3.9997 3.8790 4.4600 3.6582 3.9281 3.8549 3.9074 3.9093 3.7264 3.9177 1.0160 1.0327 1.0047 0.9977 1.0201 1.0043 1.0047 1.0072 1.0171 1.0196 0.9912 1.0045 1.0102 1.0042
dispcorr: -0.024733106 hartree
energy: -1965.999049729316
dipole: -19.60168 18.95838 -0.64330 -27.77679 26.77240 -1.00439 -2.07573 2.52362 0.44789
magnitude: 1.27407 au
magnitude: 3.23842 debye
