program: Orca
programVersion: 5.0.3
elementType: Cl F F F F F F F O O C C C C C C C C C C C C C C C C C H H H H H H H H H H H H H H
charge: 0
multiplicity: 1
keywords: wb97x-d3
keywords: def2-TZVPP
keywords: def2/J RIJCOSX
keywords: DEFGRID2
keywords: scfconv7
keywords: smallprint printgap noloewdin
keywords: NOSOSCF
formula: C17H14ClF7O2
InChI: InChI=1/C17H14ClF7O2/c1-6-11(19)13(21)7(14(22)12(6)20)5-27-15(26)10-8(16(10,2)3)4-9(18)17(23,24)25/h4,8,10H,5H2,1-3H3
41 atoms
Cl -5.396218 0.802635 0.215296
F  -2.580884 3.471913 0.336851
F  -4.425192 3.376197 1.444039
F  -4.466248 3.518899 -0.699559
F  3.066847 1.125138 1.531793
F  2.562795 -3.389245 0.328317
F  4.178255 -3.00021 -1.76637
F  4.678568 1.503274 -0.533283
O  0.530397 -1.7993 1.702956
O  0.186409 0.206044 0.790051
C  -1.878517 -1.474129 -0.900675
C  -2.670682 -0.724787 0.135326
C  -1.453579 -1.534968 0.550638
C  -1.056373 -0.731445 -1.924583
C  -2.502093 -2.736921 -1.445066
C  -2.698351 0.741746 0.193692
C  -0.190557 -0.915593 1.006979
C  -3.805436 1.473269 0.236177
C  1.816866 -1.375227 2.142537
C  -3.815372 2.970068 0.328358
C  2.757664 -1.144394 0.994608
C  3.32133 0.093205 0.735806
C  3.07365 -2.176643 0.123237
C  3.908955 -1.97574 -0.956453
C  4.166257 0.2878 -0.343545
C  4.47986 -0.73869 -1.218547
C  5.384806 -0.549976 -2.396953
H  -3.606313 -1.196073 0.41378
H  -1.680178 -2.467057 1.055008
H  -0.262618 -1.375981 -2.306371
H  -1.690015 -0.453969 -2.768064
H  -0.590995 0.174787 -1.548072
H  -3.109562 -3.250148 -0.698759
H  -3.145204 -2.510889 -2.296942
H  -1.731677 -3.432785 -1.781551
H  -1.75541 1.269727 0.21218
H  2.173645 -2.188099 2.773348
H  1.736865 -0.480677 2.759522
H  4.846437 -0.712174 -3.33079
H  5.802968 0.451649 -2.424132
H  6.212627 -1.25782 -2.371312
totalener: -1965.97738508 hartree
nucrepener: 2798.99099053 hartree
electener: -4764.96837561 hartree
oneelecener: -8278.14941860 hartree
twoeener: 3513.18104299 hartree
kineticenergy: 1959.84411507 hartree
xcener: -152.602830045889 hartree
chargesum: -0.0000000
charge: -0.062762 -0.164778 -0.162565 -0.163201 -0.183845 -0.185060 -0.190194 -0.190763 -0.259587 -0.402253 0.063060 0.029763 -0.088734 -0.252815 -0.232524 -0.188341 0.369604 -0.075809 0.061190 0.503215 -0.224176 0.310411 0.197476 0.207189 0.229898 -0.182284 -0.201117 0.083456 0.091145 0.090364 0.097753 0.101501 0.075008 0.093822 0.093916 0.159498 0.124285 0.117591 0.104609 0.101278 0.104776
qa: -0.0628 -0.1648 -0.1626 -0.1632 -0.1838 -0.1851 -0.1902 -0.1908 -0.2596 -0.4023 0.0631 0.0298 -0.0887 -0.2528 -0.2325 -0.1883 0.3696 -0.0758 0.0612 0.5032 -0.2242 0.3104 0.1975 0.2072 0.2299 -0.1823 -0.2011 0.0835 0.0911 0.0904 0.0978 0.1015 0.0750 0.0938 0.0939 0.1595 0.1243 0.1176 0.1046 0.1013 0.1048
va: 1.2747 1.1400 1.1422 1.1406 1.1227 1.1170 1.1139 1.1120 2.1436 2.0813 3.8012 3.7711 3.9072 3.9151 3.9124 3.8543 4.1308 4.0303 3.8674 4.4896 3.6773 3.8443 3.9550 3.9341 3.9057 3.7616 3.9223 1.0351 1.0299 1.0016 1.0030 1.0172 1.0086 1.0041 1.0039 1.0327 0.9909 1.0194 0.9994 1.0145 1.0000
dispcorr: -0.020202225 hartree
energy: -1965.997587304645
dipole: 7.63161 -6.77557 0.85604 -23.37763 21.83381 -1.54382 -12.58133 12.24121 -0.34012
magnitude: 1.79774 au
magnitude: 4.56950 debye
