program: Gaussian 09
title: 000068035
version: EM64L-G09RevD.01
frameworkgroup: C1[X(C4H7FO)]
method: RPBEPBE
basis: SDD
operation: Freq
keyword: #pfreq=noraman
keyword: PBEPBE/SDD
title: #p freq=noraman PBEPBE/SDD
converged: YES YES NO NO
title: Mulliken charges:
elementType: F O C C C C H H H H H H H
charge: -0.214364 -0.157534 -0.367175 -0.463508 -0.667887 0.266631 0.233195 0.217452 0.233729 0.250464 0.213408 0.224557 0.231033
chargesum: 0.00000
title: Mulliken charges with hydrogens summed into heavy atoms:
elementType: F O C C C C
charge: -0.214364 -0.157534 0.083472 0.020685 0.001111 0.266631
polarizability: 4.86412039e+01 -3.74276527e+00 4.67316303e+01 6.36669061e-01 5.90756424e-01 4.07696338e+01
1716.lowfreq: -30.2872 -19.9232 -17.5454 -0.0011 -0.0009 0.0008 34.1903 90.0077 182.3319
frequency: 31.4765 89.9013 182.3210 255.2874 359.2616 409.2587 519.3084 637.0349 705.1206 797.5284 857.1810 896.6993 990.7166 1076.5998 1085.5289 1146.2622 1224.3542 1255.8952 1320.1042 1343.6002 1398.1395 1445.8501 1467.8903 1479.8726 1482.8524 1766.8494 2981.0546 3002.5315 3013.4655 3054.3547 3079.7571 3083.2902 3092.3700
redmass: 5.3219 2.6839 1.7223 1.4770 2.2127 3.2056 8.0091 3.1334 3.9210 1.4815 2.6521 1.4455 2.1826 1.6175 3.0179 2.2365 1.3257 1.2479 1.2366 1.4015 1.2126 1.0977 1.0714 1.0519 1.0468 12.0188 1.0361 1.0606 1.0608 1.1006 1.1021 1.0995 1.1012
irintensity: 0.0752 1.5238 1.7233 0.4730 1.1494 1.0386 13.6757 2.5784 33.5594 59.4734 6.1285 4.2747 72.0546 4.9032 15.2021 58.2686 29.8251 5.7361 3.6345 2.0172 14.7556 13.8952 4.9692 11.3126 14.4128 241.8926 20.9964 24.4679 14.6131 0.3237 20.0274 36.8601 45.6752
temp: 298.150 k
press: 1.00000 atm
elementType: 9 8 6 6 6 6 1 1 1 1 1 1 1
symmnumber: 1
zpe: 272340.2 jmol-1
zpe.correction: 0.103729 hartree
zpe.thermalcorrener: 0.110761 hartree
zpe.thermalcorrenthalpy: 0.111705 hartree
zpe.thermalcorrgfe: 0.071761 hartree
zpe.sumelectzpe: -331.212011 hartree
zpe.sumelectthermal: -331.204979 hartree
zpe.sumelectthermalent: -331.204035 hartree
zpe.sumelectthermalfe: -331.243979 hartree
dipole: 3.0177 -0.8683 1.7896
dipole: 3.6143
quadrupole: -39.0072 -38.3805 -34.3647
quadrupole: 1.5747 -1.6069 -1.4474
quadrupole: -1.7564 -1.1297 2.8861 1.5747 -1.6069 -1.4474
hfenergy: -331.3157397 hartree
pointgroup: C01 [X(C4H7F1O1)]
dipole: -1.1792653 0.7234937 -0.3285397 debye
dipolederiv: -0.3646407 0.1536017 0.0390324 0.1462885 -0.6505501 -0.4244032 -0.0115445 -0.3566997 -0.6730314 -0.6290415 0.0139839 -0.3223658 0.1555763 -0.393102 -0.03037 -0.3066881 -0.1435292 -0.7076326 0.2581363 -0.0017121 -0.0043635 0.0981735 0.1068794 0.0235103 0.0074547 -0.0178078 0.1082434 -0.281766 0.0777857 -0.0768923 0.039745 -0.0306714 0.0178813 -0.144891 0.0828739 -0.0069051 -0.0013976 -0.0392395 0.0265332 -0.0512977 0.0444235 0.0536285 0.0245112 0.0574481 -0.0194767 0.9795784 -0.2979978 0.3528942 -0.4611451 0.938686 0.4577825 0.4047505 0.47524 1.2710037 0.0659018 -0.0036511 0.0469587 -0.0332389 -0.0216102 -0.1037242 0.0169765 -0.0828984 -0.056624 -0.0864244 0.0917289 -0.0618496 0.0829924 -0.0366908 0.0885578 -0.0378403 0.0750329 0.0399303 0.0441942 0.0204839 -0.0081177 0.017578 -0.0120256 -0.0782821 -0.0211542 -0.1247358 0.0064292 0.0539519 -0.0218817 0.0533918 0.0020841 0.0695769 0.0632071 0.0767605 0.0802002 -0.0265382 0.1011931 -0.0058292 0.0004484 0.0225812 -0.0484931 -0.1375109 0.0276327 -0.090509 -0.0594194 -0.1238624 -0.1176058 0.0065689 -0.1220738 0.049423 0.0092181 -0.0112531 -0.001348 0.080609 -0.0158231 0.1303331 -0.0522386 0.1027365 -0.0158457 0.0605048 -0.0247149 0.0467329 0.0434118 unknown
polarizability: 49.2275499|-0.5116004|41.051341|3.6316259|1.1330132|45.8635771 unknown
InChI: InChI=1S/C4H7FO/c1-2-3-4(5)6/h2-3H2,1H3
charge 0 multiplicity 1
13 atoms
F  1.121071 -0.952768 -1.008451
O  1.690932 0.094149 0.968922
C  -1.552596 0.21252 -0.490124
C  -0.201862 0.980676 -0.391442
C  -1.98921 -0.421671 0.846951
C  0.945175 0.083904 -0.000588
H  -1.467415 -0.563471 -1.272085
H  -2.318231 0.934461 -0.8315
H  -0.268738 1.791099 0.354615
H  0.034489 1.424983 -1.376756
H  -2.065743 0.338686 1.646203
H  -2.976509 -0.90584 0.743894
H  -1.272664 -1.19343 1.183563
