program: Orca
programVersion: 5.0.2
elementType: Si F O O C C C C C C C C C C C C C C C C C C C C C C C C C H H H H H H H H H H H H H H H H H H H H H H H H H H H H H
charge: 0
multiplicity: 1
keywords: wb97x-d3
keywords: def2-TZVPP
keywords: def2/J RIJCOSX
keywords: DEFGRID2
keywords: scfconv7
keywords: smallprint printgap noloewdin
keywords: NOSOSCF
formula: C25H29FO2Si
InChI: InChI=1/C25H29FO2Si/c1-4-27-21-13-15-23(16-14-21)29(2,3)18-8-9-20-12-17-24(26)25(19-20)28-22-10-6-5-7-11-22/h5-7,10-17,19H,4,8-9,18H2,1-3H3
58 atoms
Si -3.612306 1.411291 -0.221686
F  2.351855 -2.287318 0.738405
O  1.991646 2.225002 1.915729
O  1.552335 -2.049844 -1.882548
C  -3.52986 -0.289039 -1.052765
C  -3.847956 -1.479529 -0.139623
C  -1.918288 1.722872 0.546334
C  -4.946696 1.432946 1.105773
C  -3.964245 2.73747 -1.506474
C  -3.107431 -2.76545 -0.527753
C  -1.34577 0.791218 1.414223
C  -1.130776 2.827195 0.204979
C  -1.640568 -2.676254 -0.210133
C  -0.050756 0.920339 1.899693
C  0.158602 2.985381 0.684973
C  0.715495 2.021575 1.525493
C  -0.700127 -2.378089 -1.191965
C  -1.201287 -2.829224 1.103669
C  0.644337 -2.247912 -0.877923
C  0.138188 -2.691693 1.434233
C  1.048574 -2.405468 0.439569
C  2.692651 1.158708 2.548653
C  4.141865 1.558358 2.663176
C  2.4033 -0.972051 -1.816391
C  2.032717 0.239066 -1.247977
C  3.655023 -1.136219 -2.393265
C  2.944034 1.287755 -1.247452
C  4.550751 -0.077962 -2.388995
C  4.204097 1.135483 -1.809057
H  -4.190693 -0.313414 -1.92475
H  -2.515835 -0.376105 -1.4581
H  -4.923965 -1.666562 -0.159593
H  -3.613696 -1.264427 0.907162
H  -5.92389 1.180652 0.687914
H  -4.74021 0.719997 1.906495
H  -5.032968 2.41991 1.564809
H  -3.22586 2.736902 -2.310493
H  -4.940868 2.566875 -1.964942
H  -3.982528 3.739809 -1.074458
H  -3.541817 -3.605848 0.019074
H  -3.25238 -2.969174 -1.591316
H  -1.90817 -0.080944 1.72753
H  -1.519861 3.587278 -0.462858
H  0.340012 0.158664 2.561124
H  0.748822 3.846242 0.394677
H  -1.007325 -2.259855 -2.22438
H  -1.914672 -3.058667 1.885534
H  0.47746 -2.816446 2.454655
H  2.596582 0.242033 1.957869
H  2.268722 0.960581 3.5382
H  4.591408 1.713568 1.681668
H  4.264167 2.468439 3.250913
H  4.696323 0.763855 3.162017
H  1.04789 0.377125 -0.817468
H  3.925684 -2.086455 -2.835734
H  2.659832 2.236202 -0.81182
H  5.528742 -0.209286 -2.832961
H  4.906804 1.95777 -1.801495
elementType: Si F O C H
totalener: -1510.05180791 hartree
nucrepener: 3036.40571991 hartree
electener: -4546.45752782 hartree
oneelecener: -8103.33526011 hartree
twoeener: 3556.87773229 hartree
cpcmener: -0.02579142 hartree
kineticenergy: 1503.91007252 hartree
xcener: -135.232584321930 hartree
chargesum: -0.0000000
charge: 0.500196 -0.223183 -0.342155 -0.343318 -0.280521 -0.146056 -0.159206 -0.414167 -0.466863 -0.086427 -0.179883 -0.078400 0.106476 -0.264463 -0.278146 0.305647 -0.292676 -0.255609 0.227438 -0.175008 0.244591 0.046470 -0.269302 0.258639 -0.136513 -0.242006 -0.163571 -0.122652 -0.193720 0.096944 0.087085 0.093819 0.072365 0.106505 0.102855 0.106865 0.105800 0.107630 0.102488 0.097638 0.086830 0.162874 0.144306 0.147015 0.136967 0.139014 0.145472 0.153376 0.085515 0.114424 0.082544 0.091638 0.091706 0.135012 0.146733 0.159733 0.160736 0.160501
qa: 0.5002 -0.2232 -0.3422 -0.3433 -0.2805 -0.1461 -0.1592 -0.4142 -0.4669 -0.0864 -0.1799 -0.0784 0.1065 -0.2645 -0.2781 0.3056 -0.2927 -0.2556 0.2274 -0.1750 0.2446 0.0465 -0.2693 0.2586 -0.1365 -0.2420 -0.1636 -0.1227 -0.1937 0.0969 0.0871 0.0938 0.0724 0.1065 0.1029 0.1069 0.1058 0.1076 0.1025 0.0976 0.0868 0.1629 0.1443 0.1470 0.1370 0.1390 0.1455 0.1534 0.0855 0.1144 0.0825 0.0916 0.0917 0.1350 0.1467 0.1597 0.1607 0.1605
va: 4.0989 1.0579 2.0422 2.0569 3.8195 3.9014 3.7590 3.8776 3.9304 3.8318 3.8670 3.8144 3.5129 3.8640 3.9847 3.7118 4.0054 3.8797 3.6777 3.8434 3.9072 3.7855 3.9674 3.7220 3.8064 3.9982 3.8351 3.8921 3.9123 1.0086 1.0100 1.0096 1.0012 1.0063 1.0096 1.0098 1.0092 1.0121 1.0101 1.0050 1.0088 0.9702 0.9854 1.0055 1.0131 1.0154 1.0011 0.9966 0.9876 0.9908 1.0045 1.0042 1.0061 1.0138 1.0085 0.9978 0.9866 0.9907
dispcorr: -0.036475616 hartree
energy: -1510.088283529944
dipole: -19.29843 18.41976 -0.87867 12.55933 -13.01902 -0.45969 4.18302 -3.57200 0.61102
magnitude: 1.16479 au
magnitude: 2.96065 debye
