program: Orca
programVersion: 5.0.2
elementType: Si F O O C C C C C C C C C C C C C C C C C C C C C C C C C H H H H H H H H H H H H H H H H H H H H H H H H H H H H H
charge: 0
multiplicity: 1
keywords: wb97x-d3
keywords: def2-TZVPP
keywords: def2/J RIJCOSX
keywords: DEFGRID2
keywords: scfconv7
keywords: smallprint printgap noloewdin
keywords: NOSOSCF
formula: C25H29FO2Si
InChI: InChI=1/C25H29FO2Si/c1-4-27-21-13-15-23(16-14-21)29(2,3)18-8-9-20-12-17-24(26)25(19-20)28-22-10-6-5-7-11-22/h5-7,10-17,19H,4,8-9,18H2,1-3H3
58 atoms
Si -3.04211 -0.530234 0.921939
F  2.944181 1.168883 -0.728696
O  1.271109 3.534787 2.191052
O  2.347038 -1.212972 -1.764501
C  -2.910163 -0.883813 -0.92968
C  -3.135362 0.34631 -1.823179
C  -1.710126 0.722135 1.380979
C  -2.728825 -2.122514 1.876994
C  -4.732987 0.189801 1.329575
C  -2.142417 0.451791 -2.989024
C  -0.417921 0.308531 1.705361
C  -1.940308 2.102802 1.376932
C  -0.743246 0.665337 -2.484352
C  0.604474 1.201813 1.99965
C  -0.939058 3.013219 1.666514
C  0.349425 2.570442 1.969831
C  0.165457 -0.385434 -2.429061
C  -0.362744 1.906112 -1.97489
C  1.408043 -0.221286 -1.831292
C  0.885199 2.09078 -1.403014
C  1.749201 1.018974 -1.319592
C  2.608076 3.174488 2.52501
C  2.766357 2.771262 3.975199
C  1.995515 -2.474873 -1.356137
C  2.799813 -3.510725 -1.813398
C  0.932798 -2.729907 -0.498271
C  2.534295 -4.810562 -1.410273
C  0.674876 -4.037777 -0.110803
C  1.468595 -5.082928 -0.562525
H  -1.909661 -1.301107 -1.087602
H  -3.600512 -1.685244 -1.207904
H  -3.068955 1.277515 -1.25057
H  -4.150337 0.325969 -2.22483
H  -2.707618 -1.954406 2.955187
H  -3.509786 -2.858367 1.67459
H  -1.777146 -2.5806 1.596881
H  -4.821553 0.441986 2.387879
H  -4.93844 1.098264 0.759439
H  -5.525789 -0.523074 1.094552
H  -2.189014 -0.454628 -3.596832
H  -2.434732 1.284751 -3.632888
H  -0.180459 -0.748625 1.74336
H  -2.926254 2.489162 1.144055
H  1.582847 0.809067 2.240441
H  -1.145398 4.076625 1.649162
H  -0.106061 -1.351176 -2.838665
H  -1.052971 2.739597 -2.015537
H  1.179238 3.052033 -1.002124
H  3.196151 4.069642 2.324674
H  2.976466 2.395964 1.85191
H  3.818063 2.565286 4.176107
H  2.450972 3.574112 4.641821
H  2.201537 1.874302 4.228589
H  3.627117 -3.297414 -2.478313
H  0.305891 -1.928451 -0.129684
H  3.16333 -5.614722 -1.76888
H  -0.156654 -4.233256 0.554027
H  1.259865 -6.099216 -0.256961
elementType: Si F O C H
totalener: -1510.05009395 hartree
nucrepener: 3034.45572392 hartree
electener: -4544.50581787 hartree
oneelecener: -8099.37018704 hartree
twoeener: 3554.86436917 hartree
cpcmener: -0.02745768 hartree
kineticenergy: 1503.90545527 hartree
xcener: -135.236147436384 hartree
chargesum: 0.0000000
charge: 0.455795 -0.224944 -0.351048 -0.343837 -0.240284 -0.136900 -0.130233 -0.417738 -0.441736 -0.091818 -0.202109 -0.096994 0.107490 -0.211843 -0.295609 0.344840 -0.280393 -0.295360 0.290947 -0.127294 0.152896 0.062755 -0.266569 0.269597 -0.229173 -0.130578 -0.145046 -0.192609 -0.165186 0.064780 0.101169 0.067727 0.092283 0.107735 0.106857 0.082276 0.105950 0.100839 0.105573 0.086408 0.094631 0.143109 0.143386 0.139259 0.132509 0.150131 0.144217 0.153832 0.109555 0.075588 0.094769 0.088564 0.091359 0.147235 0.117653 0.161072 0.163411 0.161106
qa: 0.4558 -0.2249 -0.3510 -0.3438 -0.2403 -0.1369 -0.1302 -0.4177 -0.4417 -0.0918 -0.2021 -0.0970 0.1075 -0.2118 -0.2956 0.3448 -0.2804 -0.2954 0.2909 -0.1273 0.1529 0.0628 -0.2666 0.2696 -0.2292 -0.1306 -0.1450 -0.1926 -0.1652 0.0648 0.1012 0.0677 0.0923 0.1077 0.1069 0.0823 0.1059 0.1008 0.1056 0.0864 0.0946 0.1431 0.1434 0.1393 0.1325 0.1501 0.1442 0.1538 0.1096 0.0756 0.0948 0.0886 0.0914 0.1472 0.1177 0.1611 0.1634 0.1611
va: 4.1177 1.0541 2.0431 2.0733 3.8116 3.9075 3.6340 3.9070 3.9170 3.8493 3.8793 3.8215 3.5380 3.8156 4.0394 3.6593 3.9672 3.9028 3.6375 3.7815 4.0251 3.8335 3.9274 3.7421 3.9618 3.8409 3.9063 3.9169 3.8934 1.0136 1.0102 1.0038 1.0110 1.0115 1.0112 1.0148 1.0096 1.0111 1.0104 1.0090 1.0068 0.9752 0.9834 1.0052 1.0154 1.0016 1.0050 0.9924 0.9930 1.0085 1.0081 1.0053 1.0021 1.0077 0.9977 0.9877 0.9898 0.9898
dispcorr: -0.036433230 hartree
energy: -1510.086527178318
dipole: -21.54333 20.70713 -0.83619 -3.23214 2.61011 -0.62203 11.90343 -11.90870 -0.00527
magnitude: 1.04219 au
magnitude: 2.64905 debye
