program: Orca
programVersion: 5.0.2
elementType: Si F O O C C C C C C C C C C C C C C C C C C C C C C C C C H H H H H H H H H H H H H H H H H H H H H H H H H H H H H
charge: 0
multiplicity: 1
keywords: wb97x-d3
keywords: def2-TZVPP
keywords: def2/J RIJCOSX
keywords: DEFGRID2
keywords: scfconv7
keywords: smallprint printgap noloewdin
keywords: NOSOSCF
formula: C25H29FO2Si
InChI: InChI=1/C25H29FO2Si/c1-4-27-21-13-15-23(16-14-21)29(2,3)18-8-9-20-12-17-24(26)25(19-20)28-22-10-6-5-7-11-22/h5-7,10-17,19H,4,8-9,18H2,1-3H3
58 atoms
Si -4.197537 1.502876 0.705359
F  2.165851 -3.844648 -0.744333
O  1.795696 2.337998 0.97487
O  1.869501 -1.419887 0.500682
C  -4.565281 -0.328126 1.088189
C  -3.385818 -1.285796 0.926211
C  -2.338884 1.811982 0.754565
C  -5.02539 2.560257 2.025073
C  -4.861163 1.963816 -0.993317
C  -2.894921 -1.407644 -0.517942
C  -1.603276 2.107731 -0.391139
C  -1.619018 1.70367 1.951451
C  -1.553277 -2.076952 -0.614637
C  -0.223586 2.288833 -0.369213
C  -0.248199 1.878014 2.000531
C  0.464361 2.174722 0.835631
C  -0.436363 -1.441936 -0.071013
C  -1.381249 -3.315531 -1.219673
C  0.810393 -2.032872 -0.112936
C  -0.129088 -3.919052 -1.276468
C  0.951364 -3.277093 -0.715995
C  2.569332 2.706527 -0.163848
C  3.981173 2.971234 0.295967
C  2.95869 -1.051899 -0.248563
C  2.898927 -0.834555 -1.618584
C  4.145755 -0.869264 0.44836
C  4.049265 -0.438251 -2.28918
C  5.283175 -0.468927 -0.235425
C  5.243312 -0.25352 -1.607075
H  -4.932515 -0.38644 2.117729
H  -5.403126 -0.654147 0.461507
H  -3.653136 -2.282575 1.28959
H  -2.562189 -0.948312 1.560715
H  -4.903668 3.626878 1.827638
H  -6.097315 2.35674 2.077484
H  -4.61048 2.36018 3.015359
H  -5.943828 1.822144 -1.025132
H  -4.664276 3.008125 -1.243095
H  -4.43484 1.346534 -1.786614
H  -3.630596 -1.953791 -1.112565
H  -2.818588 -0.412819 -0.966614
H  -2.104599 2.198791 -1.348084
H  -2.133735 1.475384 2.878715
H  0.289146 2.510828 -1.29539
H  0.281467 1.787664 2.941171
H  -0.53637 -0.474207 0.406141
H  -2.23147 -3.826127 -1.653868
H  0.000573 -4.886617 -1.743949
H  2.150631 3.603807 -0.630323
H  2.547266 1.904146 -0.908036
H  4.024462 3.812864 0.987564
H  4.417133 2.098551 0.781479
H  4.600355 3.215347 -0.566894
H  1.974277 -0.957402 -2.168462
H  4.177501 -1.040311 1.516885
H  4.002664 -0.269886 -3.357124
H  6.206384 -0.328757 0.311429
H  6.134167 0.053813 -2.138059
elementType: Si F O C H
totalener: -1510.05303371 hartree
nucrepener: 2981.26684421 hartree
electener: -4491.31987792 hartree
oneelecener: -7993.30919767 hartree
twoeener: 3501.98931975 hartree
cpcmener: -0.02625568 hartree
kineticenergy: 1503.91786378 hartree
xcener: -135.235552559203 hartree
chargesum: 0.0000000
charge: 0.494991 -0.219666 -0.341374 -0.333007 -0.293520 -0.113939 -0.109482 -0.458043 -0.434989 -0.103611 -0.181766 -0.143868 -0.001471 -0.228098 -0.255555 0.327797 -0.139292 -0.144190 0.084674 -0.189236 0.284160 0.029655 -0.304210 0.295460 -0.174725 -0.254817 -0.164643 -0.149494 -0.168785 0.100102 0.085872 0.092019 0.081770 0.100620 0.103186 0.101287 0.110407 0.108288 0.104263 0.096674 0.087346 0.148012 0.138684 0.139117 0.132849 0.071928 0.142196 0.149580 0.124259 0.101946 0.102198 0.092321 0.096994 0.152881 0.144527 0.161306 0.160201 0.160207
qa: 0.4950 -0.2197 -0.3414 -0.3330 -0.2935 -0.1139 -0.1095 -0.4580 -0.4350 -0.1036 -0.1818 -0.1439 -0.0015 -0.2281 -0.2556 0.3278 -0.1393 -0.1442 0.0847 -0.1892 0.2842 0.0297 -0.3042 0.2955 -0.1747 -0.2548 -0.1646 -0.1495 -0.1688 0.1001 0.0859 0.0920 0.0818 0.1006 0.1032 0.1013 0.1104 0.1083 0.1043 0.0967 0.0873 0.1480 0.1387 0.1391 0.1328 0.0719 0.1422 0.1496 0.1243 0.1019 0.1022 0.0923 0.0970 0.1529 0.1445 0.1613 0.1602 0.1602
va: 4.0591 1.0652 2.0325 2.0382 3.8708 3.8418 3.6729 3.9005 3.9000 3.7580 3.8723 3.8666 3.6579 3.8521 4.0015 3.7040 3.8536 3.8715 3.8351 3.9296 3.9486 3.7621 3.9635 3.5576 3.8222 3.9555 3.8952 3.8631 3.8433 1.0066 1.0099 1.0084 1.0072 1.0116 1.0093 1.0113 1.0100 1.0078 1.0096 1.0143 1.0193 0.9894 0.9922 1.0120 1.0150 1.0350 1.0028 0.9990 0.9940 0.9784 1.0072 1.0009 1.0039 1.0038 1.0109 0.9898 0.9890 0.9891
dispcorr: -0.034786029 hartree
energy: -1510.087819735404
dipole: -20.27626 19.54857 -0.72770 21.55699 -21.07716 0.47983 0.62568 -1.83833 -1.21266
magnitude: 1.49342 au
magnitude: 3.79598 debye
