program: Orca
programVersion: 5.0.2
elementType: Si F O O C C C C C C C C C C C C C C C C C C C C C C C C C H H H H H H H H H H H H H H H H H H H H H H H H H H H H H
charge: 0
multiplicity: 1
keywords: wb97x-d3
keywords: def2-TZVPP
keywords: def2/J RIJCOSX
keywords: DEFGRID2
keywords: scfconv7
keywords: smallprint printgap noloewdin
keywords: NOSOSCF
formula: C25H29FO2Si
InChI: InChI=1/C25H29FO2Si/c1-4-27-21-13-15-23(16-14-21)29(2,3)18-8-9-20-12-17-24(26)25(19-20)28-22-10-6-5-7-11-22/h5-7,10-17,19H,4,8-9,18H2,1-3H3
58 atoms
Si -2.639009 1.570187 -0.786561
F  1.763855 -4.507609 -0.576352
O  2.287517 2.724904 2.545232
O  2.044548 -1.83442 -0.553109
C  -2.926555 -0.285818 -1.051335
C  -3.483757 -1.099291 0.118728
C  -1.13304 1.96187 0.274998
C  -4.163141 2.306933 0.036725
C  -2.362427 2.334772 -2.485672
C  -2.504193 -1.355175 1.270728
C  0.14318 2.085405 -0.286125
C  -1.225242 2.116211 1.658111
C  -1.337214 -2.200087 0.846706
C  1.262092 2.334873 0.48904
C  -0.115978 2.359252 2.458361
C  1.142903 2.46879 1.872412
C  -0.159199 -1.613137 0.398355
C  -1.435588 -3.590357 0.829306
C  0.879691 -2.388645 -0.0924
C  -0.390877 -4.378215 0.370331
C  0.752876 -3.766949 -0.101433
C  2.305346 2.64846 3.967501
C  2.260741 1.224599 4.479011
C  1.966806 -0.919862 -1.575279
C  0.948032 -0.932375 -2.520458
C  2.98703 0.018291 -1.646826
C  0.95188 0.019117 -3.53143
C  2.980264 0.957847 -2.666864
C  1.960208 0.969892 -3.609011
H  -3.646124 -0.340307 -1.87685
H  -2.013624 -0.744965 -1.446139
H  -3.834542 -2.069561 -0.247408
H  -4.367426 -0.60023 0.526235
H  -5.060993 2.092628 -0.547132
H  -4.328412 1.904018 1.037916
H  -4.084362 3.391602 0.130585
H  -1.516989 1.875515 -3.003131
H  -3.239045 2.199468 -3.122261
H  -2.164265 3.406205 -2.421776
H  -2.148508 -0.4084 1.68095
H  -3.043361 -1.86042 2.075042
H  0.28134 1.983621 -1.357227
H  -2.189134 2.042402 2.149518
H  2.237773 2.427101 0.027666
H  -0.256074 2.462997 3.525831
H  -0.049881 -0.534728 0.414568
H  -2.340382 -4.069216 1.182828
H  -0.468808 -5.457762 0.363464
H  1.502464 3.251578 4.400532
H  3.244129 3.118964 4.258134
H  3.088945 0.638517 4.079971
H  2.350028 1.230951 5.56566
H  1.329315 0.716375 4.228645
H  0.156607 -1.669925 -2.481289
H  3.775373 0.015457 -0.904693
H  0.155971 0.010355 -4.264738
H  3.774502 1.691229 -2.716101
H  1.953546 1.709784 -4.398012
elementType: Si F O C H
totalener: -1510.05091156 hartree
nucrepener: 3026.38890877 hartree
electener: -4536.43982032 hartree
oneelecener: -8083.25755532 hartree
twoeener: 3546.81773500 hartree
cpcmener: -0.02669888 hartree
kineticenergy: 1503.91466781 hartree
xcener: -135.238211560895 hartree
chargesum: -0.0000000
charge: 0.441859 -0.219947 -0.350628 -0.346522 -0.251795 -0.150277 -0.162493 -0.443326 -0.440264 -0.109294 -0.094509 -0.109661 -0.011423 -0.277149 -0.269407 0.339207 -0.157257 -0.173336 0.169607 -0.197544 0.223300 0.046267 -0.261252 0.313241 -0.170749 -0.286163 -0.190444 -0.110387 -0.168489 0.102215 0.067497 0.091989 0.084948 0.109888 0.101162 0.111723 0.098554 0.106987 0.106745 0.096079 0.096681 0.127816 0.150570 0.136791 0.142817 0.132001 0.145630 0.150028 0.086818 0.109312 0.088600 0.094798 0.091251 0.158638 0.147811 0.162389 0.160573 0.158526
qa: 0.4419 -0.2199 -0.3506 -0.3465 -0.2518 -0.1503 -0.1625 -0.4433 -0.4403 -0.1093 -0.0945 -0.1097 -0.0114 -0.2771 -0.2694 0.3392 -0.1573 -0.1733 0.1696 -0.1975 0.2233 0.0463 -0.2613 0.3132 -0.1707 -0.2862 -0.1904 -0.1104 -0.1685 0.1022 0.0675 0.0920 0.0849 0.1099 0.1012 0.1117 0.0986 0.1070 0.1067 0.0961 0.0967 0.1278 0.1506 0.1368 0.1428 0.1320 0.1456 0.1500 0.0868 0.1093 0.0886 0.0948 0.0913 0.1586 0.1478 0.1624 0.1606 0.1585
va: 4.1624 1.0659 2.0595 2.0668 3.8167 3.9088 3.6489 3.9208 3.9029 3.8188 3.8101 3.7713 3.6805 4.0009 3.8972 3.7794 3.8246 3.8778 3.6952 3.9002 4.0324 3.8625 3.9135 3.6204 3.8171 3.9470 3.8655 3.8396 3.8547 1.0083 1.0250 1.0005 1.0018 1.0061 1.0065 1.0087 1.0114 1.0109 1.0098 1.0135 1.0107 0.9785 0.9834 1.0162 1.0058 1.0015 0.9992 0.9978 0.9953 0.9921 1.0055 1.0089 1.0029 0.9962 1.0086 0.9906 0.9875 0.9902
dispcorr: -0.036123944 hartree
energy: -1510.087035500471
dipole: -20.98260 19.38820 -1.59440 20.95081 -20.41241 0.53840 7.05884 -6.17020 0.88864
magnitude: 1.90307 au
magnitude: 4.83721 debye
