program: Orca
programVersion: 5.0.2
elementType: Si F O O C C C C C C C C C C C C C C C C C C C C C C C C C H H H H H H H H H H H H H H H H H H H H H H H H H H H H H
charge: 0
multiplicity: 1
keywords: wb97x-d3
keywords: def2-TZVPP
keywords: def2/J RIJCOSX
keywords: DEFGRID2
keywords: scfconv7
keywords: smallprint printgap noloewdin
keywords: NOSOSCF
formula: C25H29FO2Si
InChI: InChI=1/C25H29FO2Si/c1-4-27-21-13-15-23(16-14-21)29(2,3)18-8-9-20-12-17-24(26)25(19-20)28-22-10-6-5-7-11-22/h5-7,10-17,19H,4,8-9,18H2,1-3H3
58 atoms
Si -3.98607 1.628854 1.025113
F  2.161944 -4.397436 -0.626998
O  1.628067 3.260135 -0.487428
O  1.956148 -1.86807 -1.62187
C  -4.152237 0.087278 -0.065124
C  -2.972059 -0.866657 0.100219
C  -2.253763 2.286639 0.688577
C  -4.156416 1.177838 2.84305
C  -5.272346 2.907261 0.528127
C  -2.884442 -1.949633 -0.978833
C  -1.165885 1.931338 1.484508
C  -1.970582 3.000079 -0.482096
C  -1.556947 -2.651583 -0.925612
C  0.145011 2.240984 1.138733
C  -0.676693 3.324778 -0.846516
C  0.396178 2.933491 -0.042748
C  -0.405664 -1.959653 -1.303142
C  -1.42181 -3.949158 -0.446326
C  0.840486 -2.54628 -1.20497
C  -0.173215 -4.553031 -0.346373
C  0.944886 -3.844669 -0.724645
C  2.762288 2.783567 0.229307
C  4.000484 3.194869 -0.527083
C  2.815813 -1.360648 -0.68146
C  4.009595 -0.840882 -1.169691
C  2.537318 -1.335488 0.678655
C  4.936515 -0.313219 -0.285699
C  3.480146 -0.80407 1.551042
C  4.680846 -0.295414 1.080183
H  -5.099959 -0.42594 0.127257
H  -4.201092 0.430024 -1.105514
H  -3.001222 -1.341159 1.085375
H  -2.040871 -0.295534 0.072927
H  -3.449274 0.402156 3.143261
H  -3.992846 2.040305 3.491857
H  -5.158408 0.797162 3.052304
H  -6.284157 2.521749 0.669661
H  -5.184249 3.820793 1.119013
H  -5.177885 3.185714 -0.523413
H  -3.698818 -2.668428 -0.866967
H  -3.008838 -1.4799 -1.958656
H  -1.324673 1.381294 2.40525
H  -2.775758 3.301683 -1.143319
H  0.947993 1.92715 1.792093
H  -0.484561 3.870205 -1.762599
H  -0.475776 -0.945487 -1.680138
H  -2.300398 -4.504599 -0.143437
H  -0.071623 -5.564221 0.025787
H  2.71549 1.693676 0.322779
H  2.774823 3.20296 1.240412
H  4.068217 4.27864 -0.626562
H  4.882918 2.856302 0.014922
H  4.029364 2.750325 -1.522151
H  4.20956 -0.858856 -2.233658
H  1.603711 -1.716888 1.071208
H  5.865525 0.086689 -0.670011
H  3.263149 -0.790133 2.611053
H  5.408449 0.114992 1.767021
elementType: Si F O C H
totalener: -1510.05391695 hartree
nucrepener: 2913.20379320 hartree
electener: -4423.25771014 hartree
oneelecener: -7856.70188929 hartree
twoeener: 3433.44417915 hartree
cpcmener: -0.02638358 hartree
kineticenergy: 1503.92086684 hartree
xcener: -135.232057331176 hartree
chargesum: -0.0000000
charge: 0.511679 -0.219526 -0.345167 -0.339825 -0.263188 -0.110263 -0.196272 -0.430463 -0.451543 -0.070123 -0.120713 -0.084626 0.005883 -0.291745 -0.313966 0.373119 -0.216908 -0.173794 0.155379 -0.178787 0.244466 0.135805 -0.298688 0.330948 -0.256726 -0.202420 -0.122362 -0.144843 -0.211580 0.085297 0.077659 0.091967 0.055175 0.101528 0.108988 0.108221 0.104425 0.104992 0.101220 0.084361 0.089302 0.145392 0.138881 0.139027 0.135598 0.138577 0.145427 0.151137 0.012716 0.106515 0.102000 0.091843 0.090925 0.146030 0.149950 0.160839 0.159809 0.158450
qa: 0.5117 -0.2195 -0.3452 -0.3398 -0.2632 -0.1103 -0.1963 -0.4305 -0.4515 -0.0701 -0.1207 -0.0846 0.0059 -0.2917 -0.3140 0.3731 -0.2169 -0.1738 0.1554 -0.1788 0.2445 0.1358 -0.2987 0.3309 -0.2567 -0.2024 -0.1224 -0.1448 -0.2116 0.0853 0.0777 0.0920 0.0552 0.1015 0.1090 0.1082 0.1044 0.1050 0.1012 0.0844 0.0893 0.1454 0.1389 0.1390 0.1356 0.1386 0.1454 0.1511 0.0127 0.1065 0.1020 0.0918 0.0909 0.1460 0.1499 0.1608 0.1598 0.1585
va: 4.1296 1.0662 2.0697 2.0639 3.8479 3.8582 3.7538 3.9002 3.9108 3.8045 3.8476 3.8679 3.6794 3.8960 4.0614 3.6995 3.9656 3.8949 3.7230 3.9035 3.9995 3.7508 3.9722 3.6226 3.9640 3.8240 3.8260 3.8406 3.8577 1.0162 1.0147 1.0078 1.0171 1.0085 1.0075 1.0089 1.0099 1.0093 1.0111 1.0132 1.0073 0.9914 0.9907 1.0140 1.0150 1.0114 1.0016 0.9980 1.0113 0.9896 1.0074 1.0038 1.0021 1.0096 1.0068 0.9883 0.9907 0.9918
dispcorr: -0.031743015 hartree
energy: -1510.085659960058
dipole: -18.46054 17.79646 -0.66408 21.86487 -21.95974 -0.09487 9.88793 -8.87006 1.01788
magnitude: 1.21905 au
magnitude: 3.09857 debye
