program: Orca
programVersion: 5.0.2
elementType: Si F O O C C C C C C C C C C C C C C C C C C C C C C C C C H H H H H H H H H H H H H H H H H H H H H H H H H H H H H
charge: 0
multiplicity: 1
keywords: wb97x-d3
keywords: def2-TZVPP
keywords: def2/J RIJCOSX
keywords: DEFGRID2
keywords: scfconv7
keywords: smallprint printgap noloewdin
keywords: NOSOSCF
formula: C25H29FO2Si
InChI: InChI=1/C25H29FO2Si/c1-4-27-21-13-15-23(16-14-21)29(2,3)18-8-9-20-12-17-24(26)25(19-20)28-22-10-6-5-7-11-22/h5-7,10-17,19H,4,8-9,18H2,1-3H3
58 atoms
Si -4.034204 0.903674 0.834031
F  1.417645 -1.631166 -3.039997
O  1.686366 2.865905 0.570302
O  1.761592 -0.171702 -0.734459
C  -4.155897 -0.743646 -0.095082
C  -3.782908 -2.005925 0.68468
C  -2.27026 1.556761 0.816607
C  -4.614352 0.685347 2.610459
C  -5.12349 2.147762 -0.069287
C  -2.325487 -2.082844 1.139995
C  -1.511461 1.714523 1.972876
C  -1.64688 1.883595 -0.394197
C  -1.31679 -1.990381 0.024931
C  -0.191263 2.153596 1.945539
C  -0.338677 2.324658 -0.448322
C  0.409037 2.449709 0.724994
C  -0.195942 -1.176336 0.157414
C  -1.47027 -2.714593 -1.155709
C  0.730329 -1.057007 -0.865414
C  -0.548039 -2.608963 -2.186685
C  0.535389 -1.770537 -2.038245
C  2.539609 2.961509 1.706492
C  3.069929 1.620364 2.167321
C  3.052963 -0.603719 -0.886255
C  3.976616 0.351849 -1.289768
C  3.4483 -1.904672 -0.609182
C  5.30918 -0.004863 -1.425577
C  4.78644 -2.247279 -0.755861
C  5.720415 -1.306495 -1.165884
H  -5.195002 -0.837557 -0.429634
H  -3.567194 -0.675918 -1.016591
H  -4.015367 -2.887697 0.080317
H  -4.415733 -2.089601 1.572173
H  -4.606571 1.629288 3.158569
H  -5.638276 0.305996 2.634077
H  -3.994464 -0.022165 3.164589
H  -5.086916 3.132298 0.400854
H  -4.807486 2.2711 -1.107706
H  -6.167409 1.827534 -0.084757
H  -2.118106 -1.296902 1.870753
H  -2.182281 -3.027465 1.673958
H  -1.94276 1.48238 2.940172
H  -2.18907 1.785393 -1.328941
H  0.344137 2.243678 2.880801
H  0.122813 2.559811 -1.399969
H  -0.045274 -0.599258 1.062566
H  -2.324189 -3.36629 -1.28905
H  -0.676663 -3.16258 -3.107842
H  2.036564 3.48999 2.521004
H  3.366294 3.594096 1.383651
H  3.665216 1.14251 1.389248
H  3.717034 1.771896 3.03189
H  2.279116 0.931927 2.466043
H  3.649259 1.365181 -1.487959
H  2.734197 -2.647773 -0.276331
H  6.028275 0.739027 -1.742715
H  5.096357 -3.261909 -0.542044
H  6.759966 -1.583213 -1.279697
elementType: Si F O C H
totalener: -1510.05083018 hartree
nucrepener: 3021.42431921 hartree
electener: -4531.47514939 hartree
oneelecener: -8074.32906341 hartree
twoeener: 3542.85391402 hartree
cpcmener: -0.02766407 hartree
kineticenergy: 1503.92519961 hartree
xcener: -135.240088098290 hartree
chargesum: -0.0000000
charge: 0.494389 -0.221529 -0.352094 -0.314943 -0.265984 -0.160851 -0.131097 -0.445806 -0.458311 -0.082528 -0.165896 -0.092714 0.047518 -0.238951 -0.320832 0.351839 -0.225638 -0.217211 0.142980 -0.165558 0.253396 0.044574 -0.283689 0.280831 -0.284170 -0.181707 -0.105489 -0.155457 -0.194386 0.097971 0.079845 0.090838 0.089296 0.112806 0.114443 0.103780 0.100512 0.100624 0.102623 0.083367 0.098659 0.145834 0.134661 0.139267 0.134082 0.145289 0.144915 0.149888 0.094926 0.112634 0.090080 0.107478 0.093120 0.143610 0.155179 0.160917 0.161901 0.160767
qa: 0.4944 -0.2215 -0.3521 -0.3149 -0.2660 -0.1609 -0.1311 -0.4458 -0.4583 -0.0825 -0.1659 -0.0927 0.0475 -0.2390 -0.3208 0.3518 -0.2256 -0.2172 0.1430 -0.1656 0.2534 0.0446 -0.2837 0.2808 -0.2842 -0.1817 -0.1055 -0.1555 -0.1944 0.0980 0.0798 0.0908 0.0893 0.1128 0.1144 0.1038 0.1005 0.1006 0.1026 0.0834 0.0987 0.1458 0.1347 0.1393 0.1341 0.1453 0.1449 0.1499 0.0949 0.1126 0.0901 0.1075 0.0931 0.1436 0.1552 0.1609 0.1619 0.1608
va: 4.0962 1.0630 2.0332 2.0250 3.8474 3.9019 3.6633 3.9163 3.9007 3.8046 3.8483 3.8093 3.6092 3.8710 3.9848 3.6502 3.9490 3.8820 3.6859 3.9227 3.9947 3.8308 3.9170 3.5868 3.9575 3.9009 3.8670 3.9096 3.8994 1.0072 1.0142 1.0008 1.0007 1.0090 1.0073 1.0060 1.0099 1.0107 1.0105 1.0098 1.0048 0.9889 0.9930 1.0056 1.0145 0.9972 1.0008 0.9983 0.9978 0.9918 1.0010 1.0129 1.0012 1.0207 1.0028 0.9883 0.9894 0.9895
dispcorr: -0.035952769 hartree
energy: -1510.086782947333
dipole: -18.92757 18.55335 -0.37422 5.12202 -5.91188 -0.78986 19.67255 -18.29259 1.37996
magnitude: 1.63347 au
magnitude: 4.15195 debye
