program: Orca
programVersion: 5.0.2
elementType: Si F O O C C C C C C C C C C C C C C C C C C C C C C C C C H H H H H H H H H H H H H H H H H H H H H H H H H H H H H
charge: 0
multiplicity: 1
keywords: wb97x-d3
keywords: def2-TZVPP
keywords: def2/J RIJCOSX
keywords: DEFGRID2
keywords: scfconv7
keywords: smallprint printgap noloewdin
keywords: NOSOSCF
formula: C25H29FO2Si
InChI: InChI=1/C25H29FO2Si/c1-4-27-21-13-15-23(16-14-21)29(2,3)18-8-9-20-12-17-24(26)25(19-20)28-22-10-6-5-7-11-22/h5-7,10-17,19H,4,8-9,18H2,1-3H3
58 atoms
Si -3.376005 1.386604 0.562237
F  1.391868 -4.754024 0.584033
O  2.341549 3.378337 0.387917
O  1.407337 -2.08321 0.552568
C  -3.497167 -0.410105 -0.005233
C  -3.123332 -0.616954 -1.473943
C  -1.574179 1.941535 0.527333
C  -4.029886 1.538183 2.318868
C  -4.362462 2.48319 -0.605741
C  -2.917453 -2.077069 -1.862244
C  -0.813528 2.034934 1.691893
C  -0.93672 2.307575 -0.666469
C  -1.771065 -2.775629 -1.174055
C  0.500494 2.491827 1.693653
C  0.37065 2.757816 -0.693227
C  1.095527 2.87606 0.494746
C  -0.699804 -2.072385 -0.630909
C  -1.754395 -4.167651 -1.093258
C  0.36703 -2.737442 -0.045913
C  -0.697394 -4.844037 -0.50435
C  0.360187 -4.121429 0.007429
C  3.12231 3.543499 1.567177
C  4.46016 4.109701 1.164176
C  2.155223 -1.165409 -0.137712
C  3.028064 -0.40766 0.635448
C  2.104608 -0.995197 -1.514864
C  3.85738 0.517379 0.023577
C  2.92547 -0.043063 -2.108479
C  3.802296 0.71732 -1.350156
H  -2.850746 -1.005556 0.648438
H  -4.512772 -0.781504 0.169028
H  -2.225986 -0.047649 -1.735645
H  -3.913612 -0.205822 -2.106414
H  -3.497624 0.884989 3.013223
H  -3.9505 2.558472 2.698308
H  -5.084373 1.256744 2.359625
H  -5.408369 2.170502 -0.645631
H  -4.344565 3.527013 -0.286415
H  -3.975892 2.4480 -1.626366
H  -3.835702 -2.638995 -1.67124
H  -2.75481 -2.13583 -2.943394
H  -1.246894 1.759548 2.646753
H  -1.47279 2.256405 -1.607609
H  1.031399 2.554912 2.633806
H  0.832779 3.043514 -1.630514
H  -0.679677 -0.989335 -0.654536
H  -2.583213 -4.737202 -1.495425
H  -0.692759 -5.924792 -0.444749
H  3.250379 2.58211 2.074911
H  2.613731 4.219336 2.262379
H  5.081536 4.231669 2.051033
H  4.98718 3.446856 0.476872
H  4.357321 5.087281 0.69263
H  3.066162 -0.555564 1.707325
H  1.444536 -1.585753 -2.135561
H  4.547162 1.09018 0.629365
H  2.875717 0.092763 -3.181003
H  4.441113 1.451864 -1.82186
elementType: Si F O C H
totalener: -1510.05306397 hartree
nucrepener: 2966.40702967 hartree
electener: -4476.46009364 hartree
oneelecener: -7963.84702699 hartree
twoeener: 3487.38693334 hartree
cpcmener: -0.02989620 hartree
kineticenergy: 1503.90929017 hartree
xcener: -135.235455998862 hartree
chargesum: 0.0000000
charge: 0.498790 -0.219667 -0.333713 -0.336394 -0.271895 -0.100214 -0.191355 -0.465217 -0.432474 -0.114538 -0.113579 -0.050410 0.035977 -0.261380 -0.367441 0.364029 -0.235256 -0.212326 0.248002 -0.174357 0.175495 0.023799 -0.273298 0.355609 -0.300451 -0.219270 -0.083935 -0.159479 -0.215953 0.088580 0.094437 0.073846 0.093878 0.102194 0.106618 0.106242 0.108040 0.108752 0.102901 0.086394 0.096011 0.143044 0.144896 0.139370 0.132596 0.133283 0.143542 0.150770 0.098057 0.120169 0.094530 0.081943 0.093408 0.143018 0.159141 0.165877 0.160290 0.159074
qa: 0.4988 -0.2197 -0.3337 -0.3364 -0.2719 -0.1002 -0.1914 -0.4652 -0.4325 -0.1145 -0.1136 -0.0504 0.0360 -0.2614 -0.3674 0.3640 -0.2353 -0.2123 0.2480 -0.1744 0.1755 0.0238 -0.2733 0.3556 -0.3005 -0.2193 -0.0839 -0.1595 -0.2160 0.0886 0.0944 0.0738 0.0939 0.1022 0.1066 0.1062 0.1080 0.1088 0.1029 0.0864 0.0960 0.1430 0.1449 0.1394 0.1326 0.1333 0.1435 0.1508 0.0981 0.1202 0.0945 0.0819 0.0934 0.1430 0.1591 0.1659 0.1603 0.1591
va: 4.1253 1.0666 2.0343 2.0762 3.8142 3.8810 3.7172 3.9277 3.8878 3.8899 3.8676 3.7709 3.6645 3.8920 4.0322 3.6583 3.8832 3.9288 3.6333 3.8688 4.0717 3.7937 3.9615 3.6281 3.9690 3.8633 3.7891 3.8946 3.8894 1.0091 1.0142 0.9974 1.0028 1.0100 1.0100 1.0117 1.0065 1.0085 1.0082 1.0031 1.0002 0.9871 0.9829 1.0119 1.0189 1.0027 0.9991 0.9971 0.9829 0.9918 1.0048 1.0047 1.0037 1.0137 0.9965 0.9759 0.9903 0.9921
dispcorr: -0.033607112 hartree
energy: -1510.086671086870
dipole: -14.68977 13.94863 -0.74114 26.64057 -26.00159 0.63898 -0.29798 0.05055 -0.24742
magnitude: 1.00935 au
magnitude: 2.56557 debye
