program: Gaussian 09
title: 000068032
version: EM64L-G09RevD.01
frameworkgroup: C1[X(C3H6ClFO2S)]
method: RPBEPBE
basis: SDD
operation: Freq
keyword: #p
keyword: freq=noraman
keyword: PBEPBE/SDD
title: #p freq=noraman PBEPBE/SDD
converged: YES YES NO NO
title: Mulliken charges:
elementType: Cl S F O O C C C H H H H H H
charge: -0.225126 0.850315 -0.235482 -0.410262 -0.484191 -0.399167 -0.290070 -0.184052 0.241495 0.247729 0.245357 0.242041 0.201707 0.199708
chargesum: 0.00000
title: Mulliken charges with hydrogens summed into heavy atoms:
elementType: Cl S F O O C C C
charge: -0.225126 0.850315 -0.235482 -0.410262 -0.484191 0.090057 0.197327 0.217363
polarizability: 1.02262974e+02 1.05770448e+01 7.98245040e+01 5.64921953e+00 -2.28268528e+00 5.33693345e+01
1716.lowfreq: -7.5523 -1.4555 -0.0008 0.0010 0.0019 9.0244 30.4453 49.7761 80.0896
frequency: 29.3211 49.5726 80.0823 97.1966 118.3582 158.8101 203.1883 239.1011 313.0044 362.5031 370.7834 488.2285 575.9857 798.3533 880.4186 887.9430 934.7281 966.1072 1062.2379 1063.7551 1125.4920 1174.3329 1263.0840 1274.8617 1290.1174 1368.2949 1389.9834 1473.7589 1474.7772 1489.4498 2983.9164 3004.4247 3030.5574 3048.4558 3067.3257 3103.5660
redmass: 8.8796 2.4060 4.3180 4.8799 2.6130 7.4408 11.4126 13.4138 5.9358 23.0522 8.3218 5.7514 11.2120 1.0696 1.1751 10.6115 17.6206 7.9939 4.5244 3.1381 1.4963 1.1296 1.2243 1.0865 1.2432 1.2925 1.3218 1.0784 1.0780 1.0879 1.0551 1.0564 1.0586 1.1077 1.1094 1.1076
irintensity: 1.8399 7.0441 3.4219 5.0224 0.7061 3.9077 0.1959 2.2168 10.6785 77.0810 20.8254 0.7204 76.1540 5.3753 0.0991 101.2371 54.4124 38.7992 9.3124 27.2180 4.6941 1.1502 0.1951 1.6968 6.6368 10.2833 25.2703 2.1712 4.6846 18.3551 10.2817 38.5863 19.2241 8.7986 12.0057 37.9585
temp: 298.150 k
press: 1.00000 atm
elementType: 17 16 9 8 8 6 6 6 1 1 1 1 1 1
symmnumber: 1
zpe: 246682.4 jmol-1
zpe.correction: 0.093956 hartree
zpe.thermalcorrener: 0.104351 hartree
zpe.thermalcorrenthalpy: 0.105296 hartree
zpe.thermalcorrgfe: 0.055193 hartree
zpe.sumelectzpe: -1225.585129 hartree
zpe.sumelectthermal: -1225.574734 hartree
zpe.sumelectthermalent: -1225.573790 hartree
zpe.sumelectthermalfe: -1225.623893 hartree
dipole: -0.4564 -1.1039 0.0567
dipole: 1.1959
quadrupole: -76.7943 -62.2750 -61.7688
quadrupole: -2.1694 -8.0501 3.0703
quadrupole: -9.8483 4.6710 5.1772 -2.1694 -8.0501 3.0703
hfenergy: -1225.6790858 hartree
pointgroup: C01[X(C3H6Cl1F1O2S1)]
dipole: 0.1543806 -0.1166348 0.4288735 debye
dipolederiv: -0.3671622 0.0271171 -0.107476 -0.0197749 -0.2344404 -0.0248083 -0.3711192 0.0807144 -0.7043935 1.1847504 0.0960058 0.2429284 0.4006573 0.7210978 -0.3559411 0.2525478 -0.1268491 1.1874587 -0.9044284 -0.1207375 -0.0154624 -0.1775283 -0.3517139 -0.016919 -0.0156483 -0.0181967 -0.2787737 -0.9897548 -0.0608512 -0.1217381 0.0575014 -0.3614724 -0.0857807 0.0611968 0.0133739 -0.3661171 -0.3537018 0.0556459 -0.026184 -0.2653431 -0.4205099 0.449279 0.0502405 0.00658 -0.4537667 -0.2257352 0.0157578 0.0328256 0.3701746 0.0359133 -0.0448192 0.1486769 -0.0362193 0.0919425 0.5664799 -0.0668855 0.0366618 -0.4104025 0.1782829 -0.0055503 -0.0484862 0.0124761 0.336575 0.9292028 0.1173146 0.0256465 -0.0832003 0.4545214 0.0030014 -0.0654568 0.0008704 0.4315592 0.0899456 -0.0009679 -0.0033766 -0.0030936 0.0671879 -0.0515916 -0.0278125 -0.0644326 -0.0819418 0.0857011 0.0176915 -0.0096844 -0.0039455 -0.0380643 0.0767539 0.0098436 0.09131 0.0300424 0.0123083 -0.0230791 0.0347486 0.0598761 -0.0346272 0.0519491 0.0153675 0.0839748 0.0180982 -0.0423052 -0.0139682 -0.0634067 0.0749107 0.0516877 -0.0252669 0.0020987 -0.0742627 -0.0766302 0.008239 -0.0291657 -0.0182827 -0.0051022 0.0348907 -0.0481993 -0.0073401 -0.0972556 -0.1339545 0.0064604 -0.0138778 -0.0072 0.0052704 -0.1027534 0.0778931 -0.0041087 0.1279165 -0.0000984 unknown
polarizability: 100.4135487|4.7246932|55.9530626|13.31093|-7.3503919|79.0902016 unknown
InChI: InChI=1S/C3H6FO2S.Cl/c4-2-1-3-6-7-5;/h1-3H2;
charge 0 multiplicity 1
14 atoms
Cl -3.049603 0.083797 -1.611822
S  -2.404805 0.160391 0.72399
F  4.058847 0.252876 -0.011534
O  -0.707872 0.788312 0.503907
O  -2.286498 -1.37469 1.179359
C  1.654889 0.471876 0.237068
C  0.298177 -0.233546 0.104138
C  2.796859 -0.46763 -0.168302
H  1.803502 0.799289 1.281003
H  1.673369 1.369333 -0.405403
H  0.221486 -1.116698 0.767508
H  0.083164 -0.538236 -0.939022
H  2.731103 -0.772529 -1.229388
H  2.854781 -1.360847 0.481699
