program: Orca
programVersion: 5.0.2
elementType: Si F O O C C C C C C C C C C C C C C C C C C C C C C C C C H H H H H H H H H H H H H H H H H H H H H H H H H H H H H
charge: 0
multiplicity: 1
keywords: wb97x-d3
keywords: def2-TZVPP
keywords: def2/J RIJCOSX
keywords: DEFGRID2
keywords: scfconv7
keywords: smallprint printgap noloewdin
keywords: NOSOSCF
formula: C25H29FO2Si
InChI: InChI=1/C25H29FO2Si/c1-4-27-21-13-15-23(16-14-21)29(2,3)18-8-9-20-12-17-24(26)25(19-20)28-22-10-6-5-7-11-22/h5-7,10-17,19H,4,8-9,18H2,1-3H3
58 atoms
Si -3.496818 1.741589 0.782584
F  1.734234 -5.332676 -0.023476
O  1.692676 4.267961 -1.058124
O  2.28038 -2.75582 -0.538225
C  -3.695482 0.236113 -0.34757
C  -2.61562 -0.815955 -0.111024
C  -1.877586 2.579587 0.305876
C  -3.391573 1.193115 2.579936
C  -4.931821 2.927064 0.51517
C  -2.500062 -1.847535 -1.235456
C  -1.835297 3.62914 -0.617874
C  -0.649057 2.116047 0.780304
C  -1.375743 -2.810413 -0.978491
C  -0.639818 4.173195 -1.055739
C  0.563185 2.640272 0.350786
C  0.573686 3.675135 -0.580951
C  -0.065989 -2.337848 -0.922558
C  -1.607563 -4.159738 -0.73439
C  0.980577 -3.180097 -0.590083
C  -0.562636 -5.021439 -0.427422
C  0.717703 -4.520235 -0.343216
C  2.957594 3.639788 -0.866443
C  3.131678 2.403467 -1.722916
C  2.62205 -1.69177 0.258595
C  1.850348 -1.255934 1.329281
C  3.83071 -1.073364 -0.038532
C  2.298264 -0.186437 2.094166
C  4.267197 -0.013005 0.740965
C  3.502024 0.441956 1.806953
H  -4.690154 -0.204782 -0.226748
H  -3.647748 0.593301 -1.382772
H  -2.803372 -1.333524 0.834055
H  -1.640685 -0.332503 0.003679
H  -4.289777 0.651695 2.883569
H  -2.541072 0.530873 2.753881
H  -3.280735 2.047434 3.250544
H  -5.020191 3.223675 -0.531763
H  -5.87723 2.459382 0.797087
H  -4.826448 3.83783 1.107298
H  -3.440141 -2.393732 -1.341319
H  -2.333091 -1.32147 -2.179843
H  -2.756196 4.037815 -1.018802
H  -0.614116 1.312379 1.508128
H  -0.639396 4.983832 -1.774569
H  1.479257 2.225954 0.750749
H  0.141918 -1.292608 -1.123417
H  -2.616835 -4.548505 -0.780026
H  -0.744006 -6.071529 -0.23831
H  3.128827 3.417415 0.190871
H  3.687613 4.396459 -1.151924
H  2.451388 1.598417 -1.444425
H  2.977041 2.634889 -2.777285
H  4.148956 2.028121 -1.610453
H  0.913146 -1.734866 1.580084
H  4.425482 -1.424695 -0.872335
H  1.694345 0.152832 2.925689
H  5.210101 0.463047 0.50532
H  3.842238 1.274113 2.408488
elementType: Si F O C H
totalener: -1510.05191317 hartree
nucrepener: 2908.53950485 hartree
electener: -4418.59141802 hartree
oneelecener: -7846.69047386 hartree
twoeener: 3428.09905584 hartree
cpcmener: -0.02738536 hartree
kineticenergy: 1503.90708362 hartree
xcener: -135.232407405062 hartree
chargesum: -0.0000000
charge: 0.493136 -0.219483 -0.353904 -0.342508 -0.259272 -0.090339 -0.150900 -0.424913 -0.461363 -0.065848 -0.103212 -0.187373 0.003033 -0.267762 -0.206562 0.293555 -0.219660 -0.185336 0.199646 -0.175178 0.193149 0.058091 -0.277016 0.332231 -0.199256 -0.246606 -0.190076 -0.150175 -0.170921 0.086862 0.075069 0.089436 0.044459 0.108554 0.101705 0.109324 0.101188 0.106617 0.106377 0.080661 0.090057 0.139238 0.153114 0.134597 0.134726 0.150269 0.143537 0.150452 0.083550 0.109722 0.079578 0.104320 0.096863 0.157646 0.146306 0.165608 0.162298 0.162695
qa: 0.4931 -0.2195 -0.3539 -0.3425 -0.2593 -0.0903 -0.1509 -0.4249 -0.4614 -0.0658 -0.1032 -0.1874 0.0030 -0.2678 -0.2066 0.2936 -0.2197 -0.1853 0.1996 -0.1752 0.1931 0.0581 -0.2770 0.3322 -0.1993 -0.2466 -0.1901 -0.1502 -0.1709 0.0869 0.0751 0.0894 0.0445 0.1086 0.1017 0.1093 0.1012 0.1066 0.1064 0.0807 0.0901 0.1392 0.1531 0.1346 0.1347 0.1503 0.1435 0.1505 0.0835 0.1097 0.0796 0.1043 0.0969 0.1576 0.1463 0.1656 0.1623 0.1627
va: 4.1345 1.0661 2.0557 2.0725 3.8462 3.8830 3.7574 3.8842 3.9277 3.8093 3.8869 3.8857 3.6753 4.0376 3.7985 3.7865 3.9320 3.8914 3.6695 3.8715 4.0652 3.8349 3.9183 3.6560 3.8446 3.9471 3.8548 3.8435 3.8148 1.0140 1.0160 1.0060 1.0077 1.0072 1.0090 1.0083 1.0107 1.0109 1.0096 1.0145 1.0064 0.9872 0.9775 1.0144 1.0232 0.9949 1.0023 0.9976 0.9966 0.9934 0.9998 1.0101 1.0059 0.9983 1.0088 0.9890 0.9874 0.9892
dispcorr: -0.032610471 hartree
energy: -1510.084523641772
dipole: -17.85858 17.20735 -0.65123 24.63037 -24.32145 0.30892 2.72477 -2.43563 0.28915
magnitude: 0.77662 au
magnitude: 1.97401 debye
