program: Orca
programVersion: 5.0.2
elementType: Si F O O C C C C C C C C C C C C C C C C C C C C C C C C C H H H H H H H H H H H H H H H H H H H H H H H H H H H H H
charge: 0
multiplicity: 1
keywords: wb97x-d3
keywords: def2-TZVPP
keywords: def2/J RIJCOSX
keywords: DEFGRID2
keywords: scfconv7
keywords: smallprint printgap noloewdin
keywords: NOSOSCF
formula: C25H29FO2Si
InChI: InChI=1/C25H29FO2Si/c1-4-27-21-13-15-23(16-14-21)29(2,3)18-8-9-20-12-17-24(26)25(19-20)28-22-10-6-5-7-11-22/h5-7,10-17,19H,4,8-9,18H2,1-3H3
58 atoms
Si -3.734775 1.809051 0.387074
F  1.475047 -5.29775 0.51001
O  1.993363 3.507989 1.328264
O  2.200426 -3.193221 -0.953123
C  -3.62332 0.389425 -0.858519
C  -2.65584 -0.702215 -0.407588
C  -1.982751 2.417488 0.705494
C  -4.480283 1.177019 1.994206
C  -4.771974 3.217059 -0.304231
C  -2.511648 -1.845972 -1.414946
C  -1.232518 1.967781 1.798212
C  -1.339683 3.27339 -0.187286
C  -1.467494 -2.826227 -0.964106
C  0.084927 2.344347 1.986304
C  -0.016176 3.66716 -0.021305
C  0.70578 3.198525 1.073339
C  -0.123292 -2.559941 -1.21201
C  -1.800952 -3.959665 -0.228904
C  0.869476 -3.388721 -0.714544
C  -0.815888 -4.807179 0.260207
C  0.50798 -4.505465 0.025441
C  2.732744 4.251897 0.364763
C  4.15849 4.341262 0.847001
C  2.721111 -1.924085 -0.865987
C  2.300766 -1.01204 0.094068
C  3.735629 -1.601648 -1.75566
C  2.903286 0.236554 0.147423
C  4.333517 -0.350955 -1.684419
C  3.916404 0.576335 -0.739522
H  -4.620598 -0.032098 -1.026487
H  -3.299032 0.792383 -1.824588
H  -2.972671 -1.118518 0.553911
H  -1.666668 -0.267183 -0.234339
H  -3.924433 0.332522 2.405661
H  -4.512637 1.953408 2.760943
H  -5.50555 0.837268 1.831278
H  -4.834982 4.048143 0.40095
H  -4.362052 3.608859 -1.237189
H  -5.792165 2.88795 -0.512946
H  -3.473487 -2.34848 -1.541397
H  -2.237695 -1.430844 -2.388366
H  -1.677662 1.297531 2.524947
H  -1.871056 3.655583 -1.052246
H  0.643531 1.975763 2.838253
H  0.427995 4.33493 -0.74731
H  0.149432 -1.687136 -1.794285
H  -2.840604 -4.188265 -0.030819
H  -1.074016 -5.688786 0.832754
H  2.302399 5.251605 0.248672
H  2.68732 3.75457 -0.609529
H  4.749685 4.904958 0.12592
H  4.226854 4.85374 1.806913
H  4.608872 3.35305 0.948064
H  1.516774 -1.260926 0.798022
H  4.056655 -2.324223 -2.495182
H  2.581214 0.943989 0.898919
H  5.125233 -0.103091 -2.379227
H  4.380562 1.552793 -0.688923
elementType: Si F O C H
totalener: -1510.05501431 hartree
nucrepener: 2862.34472651 hartree
electener: -4372.39974082 hartree
oneelecener: -7754.80219530 hartree
twoeener: 3382.40245449 hartree
cpcmener: -0.02755616 hartree
kineticenergy: 1503.91801017 hartree
xcener: -135.229673724419 hartree
chargesum: 0.0000000
charge: 0.504457 -0.220908 -0.341680 -0.344514 -0.254983 -0.139896 -0.195340 -0.433054 -0.455898 -0.049483 -0.068070 -0.130725 0.027573 -0.321393 -0.255906 0.342986 -0.216723 -0.219661 0.200529 -0.166982 0.181878 0.032455 -0.281884 0.286868 -0.178798 -0.245246 -0.153361 -0.142037 -0.192247 0.082911 0.080279 0.092278 0.074988 0.099717 0.110598 0.109070 0.104671 0.101687 0.104664 0.085773 0.085856 0.144993 0.138516 0.137521 0.142439 0.148214 0.144308 0.150885 0.115879 0.100411 0.095507 0.096191 0.085606 0.152629 0.147806 0.171250 0.159632 0.167764
qa: 0.5045 -0.2209 -0.3417 -0.3445 -0.2550 -0.1399 -0.1953 -0.4331 -0.4559 -0.0495 -0.0681 -0.1307 0.0276 -0.3214 -0.2559 0.3430 -0.2167 -0.2197 0.2005 -0.1670 0.1819 0.0325 -0.2819 0.2869 -0.1788 -0.2452 -0.1534 -0.1420 -0.1922 0.0829 0.0803 0.0923 0.0750 0.0997 0.1106 0.1091 0.1047 0.1017 0.1047 0.0858 0.0859 0.1450 0.1385 0.1375 0.1424 0.1482 0.1443 0.1509 0.1159 0.1004 0.0955 0.0962 0.0856 0.1526 0.1478 0.1713 0.1596 0.1678
va: 4.1302 1.0634 2.0394 2.0623 3.8383 3.8715 3.7416 3.8978 3.9116 3.7902 3.7817 3.9083 3.6639 4.0105 3.9215 3.6898 3.9089 3.9081 3.6864 3.8744 4.0591 3.7810 3.9683 3.6895 3.9089 4.0016 3.8585 3.9359 3.9018 1.0168 1.0157 1.0025 1.0056 1.0092 1.0068 1.0081 1.0089 1.0113 1.0098 1.0110 1.0102 0.9876 0.9924 1.0134 1.0097 1.0034 1.0024 0.9972 0.9898 0.9855 1.0047 1.0043 1.0012 1.0025 1.0063 0.9903 0.9900 0.9816
dispcorr: -0.030314579 hartree
energy: -1510.085328890609
dipole: -17.15208 16.35178 -0.80030 32.57975 -31.00386 1.57589 -0.24381 -0.56028 -0.80410
magnitude: 1.94178 au
magnitude: 4.93560 debye
