program: Orca
programVersion: 5.0.2
elementType: Si F O O C C C C C C C C C C C C C C C C C C C C C C C C C H H H H H H H H H H H H H H H H H H H H H H H H H H H H H
charge: 0
multiplicity: 1
keywords: wb97x-d3
keywords: def2-TZVPP
keywords: def2/J RIJCOSX
keywords: DEFGRID2
keywords: scfconv7
keywords: smallprint printgap noloewdin
keywords: NOSOSCF
formula: C25H29FO2Si
InChI: InChI=1/C25H29FO2Si/c1-4-27-21-13-15-23(16-14-21)29(2,3)18-8-9-20-12-17-24(26)25(19-20)28-22-10-6-5-7-11-22/h5-7,10-17,19H,4,8-9,18H2,1-3H3
58 atoms
Si -3.570901 1.071208 1.114435
F  2.081735 -3.61102 -0.439975
O  2.009679 2.718407 -0.55337
O  1.900175 -0.938154 -1.04125
C  -3.646466 -0.824864 1.125641
C  -3.998766 -1.498906 -0.200595
C  -1.870121 1.663532 0.568954
C  -3.857871 1.675392 2.876067
C  -4.881701 1.766429 -0.042383
C  -2.974615 -1.303751 -1.318629
C  -1.644237 2.317071 -0.640015
C  -0.748231 1.415495 1.368703
C  -1.625777 -1.913943 -1.043457
C  -0.371405 2.690057 -1.060251
C  0.525275 1.783589 0.977665
C  0.728329 2.411955 -0.252361
C  -0.46827 -1.142785 -1.098858
C  -1.501849 -3.271641 -0.754236
C  0.779778 -1.708782 -0.894478
C  -0.259482 -3.850346 -0.541169
C  0.870687 -3.065355 -0.623244
C  2.329275 3.228763 -1.844409
C  2.318606 2.164365 -2.920072
C  2.763072 -0.781793 0.012413
C  4.033629 -0.319002 -0.305396
C  2.407402 -1.024345 1.332202
C  4.954312 -0.101058 0.707475
C  3.342844 -0.803786 2.334863
C  4.616727 -0.344851 2.032602
H  -2.699797 -1.216738 1.514451
H  -4.399651 -1.106415 1.869616
H  -4.960574 -1.121184 -0.558052
H  -4.14831 -2.570847 -0.03943
H  -4.838945 1.371003 3.24667
H  -3.11252 1.27064 3.564126
H  -3.804567 2.763803 2.940814
H  -5.876685 1.42177 0.246808
H  -4.898143 2.857803 -0.020227
H  -4.723561 1.461861 -1.07885
H  -3.377975 -1.748012 -2.233291
H  -2.850574 -0.239676 -1.53358
H  -2.474997 2.541327 -1.299464
H  -0.86008 0.91643 2.325612
H  -0.263744 3.182924 -2.016941
H  1.374818 1.580065 1.617321
H  -0.527421 -0.08475 -1.325386
H  -2.383134 -3.898735 -0.705518
H  -0.165926 -4.90735 -0.327912
H  3.333024 3.639929 -1.740102
H  1.671307 4.06267 -2.104315
H  2.592635 2.620499 -3.871936
H  3.045664 1.380862 -2.706707
H  1.340412 1.70073 -3.048132
H  4.297362 -0.133037 -1.339033
H  1.412891 -1.36258 1.594235
H  5.943737 0.256969 0.454833
H  3.06324 -0.990221 3.363483
H  5.338647 -0.176985 2.820302
elementType: Si F O C H
totalener: -1510.05209910 hartree
nucrepener: 3048.57836908 hartree
electener: -4558.63046818 hartree
oneelecener: -8128.43383263 hartree
twoeener: 3569.80336445 hartree
cpcmener: -0.02861966 hartree
kineticenergy: 1503.92560548 hartree
xcener: -135.240697570740 hartree
chargesum: -0.0000000
charge: 0.496111 -0.219630 -0.348668 -0.331627 -0.264932 -0.160342 -0.127311 -0.464380 -0.444181 -0.091496 -0.166835 -0.099453 -0.035041 -0.225147 -0.309448 0.331711 -0.198552 -0.155711 0.149533 -0.199087 0.282573 0.044431 -0.277722 0.329818 -0.293912 -0.206808 -0.118226 -0.169756 -0.185500 0.080137 0.097488 0.088921 0.093334 0.103027 0.101152 0.100787 0.113940 0.114260 0.103380 0.102790 0.084058 0.144816 0.132848 0.139571 0.137980 0.146901 0.143203 0.149027 0.112045 0.093618 0.105348 0.086309 0.090696 0.163284 0.149579 0.159810 0.160653 0.160627
qa: 0.4961 -0.2196 -0.3487 -0.3316 -0.2649 -0.1603 -0.1273 -0.4644 -0.4442 -0.0915 -0.1668 -0.0995 -0.0350 -0.2251 -0.3094 0.3317 -0.1986 -0.1557 0.1495 -0.1991 0.2826 0.0444 -0.2777 0.3298 -0.2939 -0.2068 -0.1182 -0.1698 -0.1855 0.0801 0.0975 0.0889 0.0933 0.1030 0.1012 0.1008 0.1139 0.1143 0.1034 0.1028 0.0841 0.1448 0.1328 0.1396 0.1380 0.1469 0.1432 0.1490 0.1120 0.0936 0.1053 0.0863 0.0907 0.1633 0.1496 0.1598 0.1607 0.1606
va: 4.0810 1.0660 2.0424 2.0319 3.8370 3.9000 3.6475 3.9029 3.9121 3.7891 3.8528 3.8372 3.6899 3.8539 4.0044 3.6935 3.8780 3.8659 3.7351 3.9477 3.9544 3.8338 3.9151 3.5130 3.9758 3.8521 3.8947 3.9100 3.9005 1.0155 1.0056 1.0006 1.0022 1.0108 1.0111 1.0104 1.0074 1.0090 1.0066 1.0047 1.0137 0.9893 0.9957 1.0050 1.0068 0.9846 1.0018 0.9996 0.9928 0.9980 1.0136 1.0059 1.0005 0.9961 1.0078 0.9886 0.9895 0.9885
dispcorr: -0.036836364 hartree
energy: -1510.088935466298
dipole: -23.23661 22.00379 -1.23282 16.37014 -16.09461 0.27553 0.30127 -0.80115 -0.49987
magnitude: 1.35854 au
magnitude: 3.45313 debye
