program: Orca
programVersion: 5.0.2
elementType: Si F O O C C C C C C C C C C C C C C C C C C C C C C C C C H H H H H H H H H H H H H H H H H H H H H H H H H H H H H
charge: 0
multiplicity: 1
keywords: wb97x-d3
keywords: def2-TZVPP
keywords: def2/J RIJCOSX
keywords: DEFGRID2
keywords: scfconv7
keywords: smallprint printgap noloewdin
keywords: NOSOSCF
formula: C25H29FO2Si
InChI: InChI=1/C25H29FO2Si/c1-4-27-21-13-15-23(16-14-21)29(2,3)18-8-9-20-12-17-24(26)25(19-20)28-22-10-6-5-7-11-22/h5-7,10-17,19H,4,8-9,18H2,1-3H3
58 atoms
Si -4.005829 1.038668 0.840539
F  2.011593 -1.747118 1.129922
O  1.907111 2.359936 0.805154
O  1.598902 -0.21405 -1.11669
C  -4.1569 -0.709312 0.145107
C  -3.701726 -0.820354 -1.318009
C  -2.172334 1.470273 0.863896
C  -4.674401 1.09032 2.598585
C  -4.915233 2.262957 -0.259328
C  -2.880626 -2.080421 -1.616188
C  -1.58988 2.325671 -0.077283
C  -1.316317 0.911874 1.81366
C  -1.55367 -2.056266 -0.910177
C  -0.234897 2.608288 -0.070809
C  0.046512 1.182516 1.843488
C  0.597953 2.038512 0.892491
C  -0.542636 -1.207717 -1.36199
C  -1.31789 -2.818892 0.228146
C  0.660993 -1.11053 -0.688538
C  -0.115169 -2.727246 0.91896
C  0.85494 -1.866923 0.461031
C  2.840947 1.820209 1.736084
C  2.843543 2.55604 3.05869
C  2.84716 -0.6432 -1.481801
C  3.137403 -1.961595 -1.806003
C  3.831417 0.336206 -1.548945
C  4.432978 -2.295842 -2.180201
C  5.116651 -0.013401 -1.931011
C  5.427868 -1.331185 -2.242547
H  -3.548107 -1.35187 0.791056
H  -5.180096 -1.080006 0.253046
H  -3.100092 0.044319 -1.620488
H  -4.575534 -0.805142 -1.972547
H  -4.573533 2.083645 3.039892
H  -5.733108 0.824287 2.627201
H  -4.148049 0.388209 3.248631
H  -4.803565 3.289435 0.095032
H  -4.557704 2.230788 -1.290449
H  -5.984284 2.041232 -0.282316
H  -3.443844 -2.967369 -1.317069
H  -2.720656 -2.154114 -2.694687
H  -2.202063 2.788701 -0.842756
H  -1.707993 0.238888 2.569053
H  0.18851 3.271586 -0.81545
H  0.651758 0.719432 2.610867
H  -0.692477 -0.602121 -2.24852
H  -2.083502 -3.49238 0.591812
H  0.060919 -3.311633 1.812752
H  3.81158 1.927423 1.252065
H  2.674136 0.749454 1.875601
H  3.057686 3.615692 2.917741
H  1.898411 2.465708 3.593932
H  3.624368 2.14131 3.697042
H  2.373996 -2.728991 -1.779967
H  3.588883 1.362801 -1.305007
H  4.658582 -3.324967 -2.427759
H  5.879962 0.752283 -1.980001
H  6.434047 -1.601364 -2.533566
elementType: Si F O C H
totalener: -1510.05199361 hartree
nucrepener: 3041.43951345 hartree
electener: -4551.49150706 hartree
oneelecener: -8114.60454963 hartree
twoeener: 3563.11304257 hartree
cpcmener: -0.02772309 hartree
kineticenergy: 1503.91434365 hartree
xcener: -135.235245927614 hartree
chargesum: -0.0000000
charge: 0.487355 -0.225374 -0.354291 -0.328564 -0.275989 -0.121966 -0.116508 -0.448548 -0.432056 -0.097031 -0.120138 -0.253950 0.076571 -0.269357 -0.160217 0.312005 -0.283084 -0.197799 0.184513 -0.146789 0.243939 0.055528 -0.268110 0.321815 -0.202470 -0.288199 -0.162551 -0.123937 -0.192408 0.078948 0.097066 0.064484 0.095151 0.103429 0.103514 0.100827 0.109833 0.101366 0.108933 0.088361 0.096077 0.144770 0.135728 0.134485 0.140703 0.133516 0.147846 0.148126 0.104935 0.082808 0.089189 0.092007 0.096212 0.154681 0.153288 0.161106 0.160272 0.159951
qa: 0.4874 -0.2254 -0.3543 -0.3286 -0.2760 -0.1220 -0.1165 -0.4485 -0.4321 -0.0970 -0.1201 -0.2540 0.0766 -0.2694 -0.1602 0.3120 -0.2831 -0.1978 0.1845 -0.1468 0.2439 0.0555 -0.2681 0.3218 -0.2025 -0.2882 -0.1626 -0.1239 -0.1924 0.0789 0.0971 0.0645 0.0952 0.1034 0.1035 0.1008 0.1098 0.1014 0.1089 0.0884 0.0961 0.1448 0.1357 0.1345 0.1407 0.1335 0.1478 0.1481 0.1049 0.0828 0.0892 0.0920 0.0962 0.1547 0.1533 0.1611 0.1603 0.1600
va: 4.1344 1.0495 2.0220 2.0095 3.8313 3.8713 3.6535 3.9053 3.9083 3.8565 3.8411 3.9379 3.5575 4.0264 3.7773 3.6672 4.0021 3.8921 3.5545 3.9269 3.8884 3.8125 3.9624 3.6638 3.9014 3.9604 3.9108 3.9058 3.9067 1.0169 1.0112 1.0068 1.0082 1.0093 1.0106 1.0109 1.0070 1.0083 1.0088 1.0064 1.0065 0.9859 0.9958 1.0130 1.0032 1.0194 0.9997 0.9998 0.9894 1.0059 1.0050 1.0020 1.0067 1.0019 1.0142 0.9898 0.9902 0.9895
dispcorr: -0.036117178 hartree
energy: -1510.088110791560
dipole: -20.69062 20.15068 -0.53993 8.55368 -9.60269 -1.04901 5.45751 -5.19920 0.25831
magnitude: 1.20776 au
magnitude: 3.06988 debye
