program: Orca
programVersion: 5.0.2
elementType: Si F O O C C C C C C C C C C C C C C C C C C C C C C C C C H H H H H H H H H H H H H H H H H H H H H H H H H H H H H
charge: 0
multiplicity: 1
keywords: wb97x-d3
keywords: def2-TZVPP
keywords: def2/J RIJCOSX
keywords: DEFGRID2
keywords: scfconv7
keywords: smallprint printgap noloewdin
keywords: NOSOSCF
formula: C25H29FO2Si
InChI: InChI=1/C25H29FO2Si/c1-4-27-21-13-15-23(16-14-21)29(2,3)18-8-9-20-12-17-24(26)25(19-20)28-22-10-6-5-7-11-22/h5-7,10-17,19H,4,8-9,18H2,1-3H3
58 atoms
Si -3.384953 1.413793 0.521139
F  0.669383 -4.018626 -3.230763
O  2.155914 3.829144 0.822797
O  1.978372 -3.028993 -1.10998
C  -3.142389 -0.452762 0.340132
C  -2.391142 -1.107697 1.496142
C  -1.699181 2.243018 0.651809
C  -4.369699 1.77443 2.084355
C  -4.290672 2.059904 -0.994673
C  -2.255213 -2.628374 1.363543
C  -0.974163 2.21125 1.843093
C  -1.081736 2.859372 -0.442437
C  -1.483525 -3.037418 0.141416
C  0.307753 2.737999 1.951947
C  0.190055 3.397392 -0.357937
C  0.904075 3.324281 0.83918
C  -0.106054 -2.840328 0.092122
C  -2.117782 -3.582236 -0.971238
C  0.618919 -3.168128 -1.042114
C  -1.400835 -3.923497 -2.109982
C  -0.040372 -3.705096 -2.137286
C  2.965644 3.687121 1.984868
C  4.335217 4.236292 1.675273
C  2.529972 -1.80613 -0.812665
C  3.787689 -1.814571 -0.226248
C  1.89579 -0.608908 -1.117718
C  4.415097 -0.61089 0.060197
C  2.535764 0.586516 -0.82213
C  3.791027 0.594798 -0.229291
H  -4.128809 -0.918078 0.228472
H  -2.61858 -0.63762 -0.603938
H  -2.899897 -0.896621 2.440955
H  -1.392179 -0.671319 1.588733
H  -4.581834 2.839969 2.187059
H  -5.326833 1.248926 2.07394
H  -3.839486 1.460402 2.985294
H  -3.762093 1.817909 -1.918496
H  -5.284737 1.61396 -1.067544
H  -4.422313 3.142991 -0.963121
H  -1.758927 -3.017425 2.256123
H  -3.250106 -3.078678 1.334352
H  -1.405762 1.759532 2.729542
H  -1.599393 2.925192 -1.392731
H  0.820703 2.677206 2.902136
H  0.647557 3.862891 -1.222641
H  0.412368 -2.426225 0.949901
H  -3.187576 -3.746819 -0.952176
H  -1.896877 -4.346138 -2.974051
H  3.033555 2.632117 2.269764
H  2.518862 4.228901 2.824592
H  4.966432 4.141795 2.558476
H  4.814461 3.687905 0.86367
H  4.295226 5.291634 1.40553
H  4.269949 -2.756145 0.002571
H  0.919356 -0.595864 -1.585067
H  5.395131 -0.619825 0.518388
H  2.04544 1.517557 -1.070364
H  4.282538 1.532115 -0.004095
elementType: Si F O C H
totalener: -1510.05496832 hartree
nucrepener: 2908.70931774 hartree
electener: -4418.76428605 hartree
oneelecener: -7847.68420568 hartree
twoeener: 3428.91991963 hartree
cpcmener: -0.02772936 hartree
kineticenergy: 1503.92699300 hartree
xcener: -135.233508355017 hartree
chargesum: 0.0000000
charge: 0.498810 -0.220364 -0.339490 -0.346736 -0.239137 -0.134405 -0.157437 -0.427545 -0.464458 -0.096743 -0.178125 -0.078551 -0.009634 -0.221687 -0.317720 0.318889 -0.161107 -0.188531 0.161477 -0.170614 0.200209 0.027271 -0.271474 0.259440 -0.224538 -0.154064 -0.153525 -0.208986 -0.178434 0.083888 0.080587 0.092886 0.074506 0.107919 0.107229 0.100124 0.101594 0.107056 0.107270 0.098764 0.083890 0.144786 0.142277 0.141078 0.136257 0.148087 0.144144 0.150399 0.101634 0.115007 0.092473 0.085336 0.091216 0.148376 0.153057 0.157664 0.192918 0.186788
qa: 0.4988 -0.2204 -0.3395 -0.3467 -0.2391 -0.1344 -0.1574 -0.4275 -0.4645 -0.0967 -0.1781 -0.0786 -0.0096 -0.2217 -0.3177 0.3189 -0.1611 -0.1885 0.1615 -0.1706 0.2002 0.0273 -0.2715 0.2594 -0.2245 -0.1541 -0.1535 -0.2090 -0.1784 0.0839 0.0806 0.0929 0.0745 0.1079 0.1072 0.1001 0.1016 0.1071 0.1073 0.0988 0.0839 0.1448 0.1423 0.1411 0.1363 0.1481 0.1441 0.1504 0.1016 0.1150 0.0925 0.0853 0.0912 0.1484 0.1531 0.1577 0.1929 0.1868
va: 4.1436 1.0647 2.0333 2.0557 3.8102 3.8782 3.7209 3.8879 3.9291 3.8585 3.9053 3.8231 3.6513 3.8984 3.9933 3.7018 3.8930 3.8615 3.6987 3.8818 4.0594 3.7900 3.9674 3.7018 3.9869 3.8631 3.9356 3.8934 3.8619 1.0155 1.0144 1.0062 1.0040 1.0081 1.0063 1.0107 1.0101 1.0101 1.0095 1.0055 1.0101 0.9871 0.9870 1.0103 1.0142 1.0046 1.0023 0.9970 0.9837 0.9906 1.0052 1.0045 1.0033 1.0061 1.0052 0.9912 0.9716 0.9704
dispcorr: -0.031746726 hartree
energy: -1510.086715043119
dipole: -12.87812 12.27846 -0.59966 24.65765 -24.06686 0.59079 19.78221 -18.07931 1.70290
magnitude: 1.89960 au
magnitude: 4.82841 debye
