program: Orca
programVersion: 5.0.2
elementType: Si F O O C C C C C C C C C C C C C C C C C C C C C C C C C H H H H H H H H H H H H H H H H H H H H H H H H H H H H H
charge: 0
multiplicity: 1
keywords: wb97x-d3
keywords: def2-TZVPP
keywords: def2/J RIJCOSX
keywords: DEFGRID2
keywords: scfconv7
keywords: smallprint printgap noloewdin
keywords: NOSOSCF
formula: C25H29FO2Si
InChI: InChI=1/C25H29FO2Si/c1-4-27-21-13-15-23(16-14-21)29(2,3)18-8-9-20-12-17-24(26)25(19-20)28-22-10-6-5-7-11-22/h5-7,10-17,19H,4,8-9,18H2,1-3H3
58 atoms
Si -3.679418 1.752318 0.361333
F  1.872439 -4.711513 -0.573477
O  2.262957 2.485408 -0.551336
O  2.20083 -2.065651 -0.48794
C  -3.945378 0.105866 1.276775
C  -2.839736 -0.933988 1.103179
C  -1.842067 2.01021 0.038572
C  -4.312067 3.146746 1.456961
C  -4.600382 1.751504 -1.279501
C  -2.676432 -1.4293 -0.335345
C  -1.30046 1.929423 -1.242861
C  -0.943114 2.253767 1.084379
C  -1.47497 -2.320295 -0.469649
C  0.059207 2.079825 -1.492167
C  0.413293 2.40909 0.863031
C  0.929009 2.323951 -0.432871
C  -0.199114 -1.760055 -0.438723
C  -1.596332 -3.70233 -0.566757
C  0.92836 -2.563691 -0.469504
C  -0.473047 -4.517202 -0.615288
C  0.776234 -3.940669 -0.549984
C  2.88396 2.361325 -1.82743
C  2.75797 3.614245 -2.667196
C  2.625306 -1.18853 0.47619
C  1.980484 -1.00681 1.692843
C  3.795125 -0.496565 0.185915
C  2.513838 -0.112615 2.612377
C  4.317111 0.386475 1.117619
C  3.677184 0.589731 2.333346
H  -4.056599 0.329173 2.342662
H  -4.907844 -0.31482 0.964524
H  -3.031365 -1.798256 1.746621
H  -1.888725 -0.51295 1.442891
H  -4.233233 4.118782 0.96672
H  -5.360925 2.995912 1.721706
H  -3.748651 3.203841 2.390982
H  -4.293315 0.927392 -1.926377
H  -5.67366 1.642206 -1.108995
H  -4.452588 2.680594 -1.8333
H  -3.577774 -1.963185 -0.645356
H  -2.569092 -0.578909 -1.013807
H  -1.945301 1.741013 -2.093662
H  -1.301947 2.325287 2.10567
H  0.410768 2.005924 -2.512075
H  1.084503 2.59942 1.69186
H  -0.083847 -0.682174 -0.382537
H  -2.578946 -4.155287 -0.603854
H  -0.567159 -5.592917 -0.688888
H  2.501784 1.484273 -2.35742
H  3.934387 2.16775 -1.610392
H  1.725748 3.849231 -2.925808
H  3.186377 4.475113 -2.153508
H  3.307284 3.475828 -3.598937
H  1.075899 -1.546517 1.939681
H  4.290809 -0.649558 -0.764559
H  2.006846 0.02948 3.557722
H  5.22619 0.925063 0.883727
H  4.082846 1.284647 3.05613
elementType: Si F O C H
totalener: -1510.05136515 hartree
nucrepener: 2997.87101484 hartree
electener: -4507.92237999 hartree
oneelecener: -8026.41011861 hartree
twoeener: 3518.48773861 hartree
cpcmener: -0.02812696 hartree
kineticenergy: 1503.91765481 hartree
xcener: -135.237105405801 hartree
chargesum: -0.0000000
charge: 0.492912 -0.219348 -0.348770 -0.341623 -0.293437 -0.100738 -0.121225 -0.461765 -0.432077 -0.093163 -0.198656 -0.107412 0.012343 -0.201629 -0.328539 0.358257 -0.180871 -0.182701 0.219167 -0.176257 0.186475 0.050328 -0.263384 0.345596 -0.201593 -0.271209 -0.178032 -0.127541 -0.187794 0.098540 0.086180 0.093498 0.068878 0.100859 0.103620 0.101093 0.104252 0.110536 0.108037 0.095823 0.088436 0.147647 0.136590 0.140002 0.138744 0.081592 0.142415 0.149994 0.094362 0.102863 0.091788 0.088437 0.095234 0.157396 0.145787 0.161341 0.158702 0.160041
qa: 0.4929 -0.2193 -0.3488 -0.3416 -0.2934 -0.1007 -0.1212 -0.4618 -0.4321 -0.0932 -0.1987 -0.1074 0.0123 -0.2016 -0.3285 0.3583 -0.1809 -0.1827 0.2192 -0.1763 0.1865 0.0503 -0.2634 0.3456 -0.2016 -0.2712 -0.1780 -0.1275 -0.1878 0.0985 0.0862 0.0935 0.0689 0.1009 0.1036 0.1011 0.1043 0.1105 0.1080 0.0958 0.0884 0.1476 0.1366 0.1400 0.1387 0.0816 0.1424 0.1500 0.0944 0.1029 0.0918 0.0884 0.0952 0.1574 0.1458 0.1613 0.1587 0.1600
va: 4.0684 1.0667 2.0351 2.0730 3.8719 3.8574 3.6802 3.9014 3.8961 3.7507 3.8859 3.8444 3.6549 3.8659 3.9875 3.6443 3.9228 3.8921 3.6468 3.8751 4.0575 3.8220 3.9522 3.6164 3.8301 3.9182 3.8630 3.8369 3.8647 1.0078 1.0111 1.0074 1.0106 1.0116 1.0094 1.0117 1.0099 1.0099 1.0078 1.0151 1.0198 0.9879 0.9930 1.0055 1.0099 1.0367 1.0033 0.9978 0.9939 0.9892 1.0023 1.0051 1.0070 0.9969 1.0087 0.9906 0.9894 0.9890
dispcorr: -0.035317519 hartree
energy: -1510.086682667791
dipole: -21.53957 20.44142 -1.09815 27.03431 -26.36731 0.66700 -1.04929 0.69747 -0.35182
magnitude: 1.33214 au
magnitude: 3.38604 debye
