program: Orca
programVersion: 5.0.2
elementType: Si F O O C C C C C C C C C C C C C C C C C C C C C C C C C H H H H H H H H H H H H H H H H H H H H H H H H H H H H H
charge: 0
multiplicity: 1
keywords: wb97x-d3
keywords: def2-TZVPP
keywords: def2/J RIJCOSX
keywords: DEFGRID2
keywords: scfconv7
keywords: smallprint printgap noloewdin
keywords: NOSOSCF
formula: C25H29FO2Si
InChI: InChI=1/C25H29FO2Si/c1-4-27-21-13-15-23(16-14-21)29(2,3)18-8-9-20-12-17-24(26)25(19-20)28-22-10-6-5-7-11-22/h5-7,10-17,19H,4,8-9,18H2,1-3H3
58 atoms
Si -3.867297 1.220681 0.791415
F  1.93828 -3.620009 0.805827
O  1.945293 2.889242 0.535507
O  1.361172 -0.950899 0.588573
C  -3.80615 -0.563632 0.16952
C  -3.401497 -0.667963 -1.303585
C  -2.096776 1.857299 0.718834
C  -4.479749 1.27385 2.568747
C  -4.962896 2.264839 -0.325737
C  -2.847873 -2.031676 -1.706362
C  -1.579801 2.478152 -0.417553
C  -1.199507 1.620815 1.767183
C  -1.568411 -2.43737 -1.016937
C  -0.240571 2.83528 -0.52995
C  0.135139 1.973845 1.682903
C  0.630619 2.578176 0.525694
C  -0.643531 -1.498416 -0.562529
C  -1.270773 -3.787373 -0.847344
C  0.529332 -1.896124 0.056817
C  -0.088802 -4.199771 -0.24815
C  0.798319 -3.248906 0.204872
C  2.550414 3.445897 -0.628332
C  2.835296 2.415339 -1.699316
C  2.652438 -0.846845 0.144526
C  3.535781 -0.184427 0.987906
C  3.073698 -1.33006 -1.086585
C  4.854824 -0.01711 0.596784
C  4.400031 -1.157481 -1.461484
C  5.296296 -0.505699 -0.626748
H  -3.086324 -1.091696 0.8049
H  -4.765242 -1.066453 0.328888
H  -2.669315 0.10186 -1.566306
H  -4.270977 -0.455226 -1.929589
H  -3.878326 0.642008 3.225369
H  -4.453402 2.287332 2.973305
H  -5.510458 0.920056 2.638548
H  -5.991997 1.899639 -0.310958
H  -4.98197 3.308642 -0.006715
H  -4.629716 2.246913 -1.365339
H  -3.601505 -2.801652 -1.521349
H  -2.67585 -2.037597 -2.787648
H  -2.226748 2.691732 -1.261094
H  -1.541703 1.144178 2.679353
H  0.096637 3.306864 -1.44294
H  0.805749 1.780418 2.511638
H  -0.827119 -0.435273 -0.665692
H  -1.97517 -4.537035 -1.185613
H  0.132696 -5.251201 -0.118221
H  3.485251 3.880858 -0.275559
H  1.945459 4.268988 -1.018765
H  3.305147 2.90858 -2.551075
H  3.52381 1.651679 -1.338465
H  1.933095 1.922381 -2.061663
H  3.190534 0.19137 1.942867
H  2.386773 -1.82974 -1.758033
H  5.541345 0.496924 1.256687
H  4.72842 -1.537623 -2.419944
H  6.327572 -0.377268 -0.926631
elementType: Si F O C H
totalener: -1510.05191795 hartree
nucrepener: 3005.35352236 hartree
electener: -4515.40544031 hartree
oneelecener: -8042.22603387 hartree
twoeener: 3526.82059356 hartree
cpcmener: -0.02824571 hartree
kineticenergy: 1503.91847928 hartree
xcener: -135.238238914856 hartree
chargesum: 0.0000000
charge: 0.493392 -0.219961 -0.349301 -0.325021 -0.272978 -0.105481 -0.154473 -0.454612 -0.431281 -0.119273 -0.159680 -0.093941 0.000276 -0.229863 -0.330092 0.343865 -0.185690 -0.166950 0.150388 -0.186659 0.255374 0.042850 -0.250914 0.328926 -0.309027 -0.202712 -0.103750 -0.142022 -0.189703 0.085136 0.094292 0.076962 0.093655 0.100320 0.104993 0.105287 0.108528 0.109716 0.102447 0.086800 0.094182 0.146700 0.137806 0.140751 0.137093 0.109912 0.143021 0.149628 0.112411 0.097209 0.107382 0.049140 0.096706 0.148741 0.152025 0.158656 0.160482 0.158332
qa: 0.4934 -0.2200 -0.3493 -0.3250 -0.2730 -0.1055 -0.1545 -0.4546 -0.4313 -0.1193 -0.1597 -0.0939 0.0003 -0.2299 -0.3301 0.3439 -0.1857 -0.1670 0.1504 -0.1867 0.2554 0.0428 -0.2509 0.3289 -0.3090 -0.2027 -0.1038 -0.1420 -0.1897 0.0851 0.0943 0.0770 0.0937 0.1003 0.1050 0.1053 0.1085 0.1097 0.1024 0.0868 0.0942 0.1467 0.1378 0.1408 0.1371 0.1099 0.1430 0.1496 0.1124 0.0972 0.1074 0.0491 0.0967 0.1487 0.1520 0.1587 0.1605 0.1583
va: 4.1358 1.0656 2.0390 2.0417 3.8252 3.8742 3.6855 3.9160 3.8962 3.8759 3.8724 3.8357 3.6720 3.8957 3.9878 3.6879 3.9116 3.8940 3.7401 3.9334 3.9819 3.8394 3.9130 3.5523 3.9620 3.8791 3.8525 3.8779 3.8813 1.0084 1.0129 0.9969 1.0042 1.0112 1.0099 1.0111 1.0076 1.0083 1.0085 1.0030 1.0006 0.9870 0.9896 1.0048 1.0114 1.0252 0.9988 0.9985 0.9920 0.9987 1.0142 1.0123 0.9998 1.0095 1.0054 0.9898 0.9901 0.9904
dispcorr: -0.035125943 hartree
energy: -1510.087043893019
dipole: -19.90130 19.22630 -0.67499 17.22240 -17.13398 0.08842 -9.11715 7.44407 -1.67307
magnitude: 1.80627 au
magnitude: 4.59117 debye
