program: Orca
programVersion: 5.0.2
elementType: Si F O O C C C C C C C C C C C C C C C C C C C C C C C C C H H H H H H H H H H H H H H H H H H H H H H H H H H H H H
charge: 0
multiplicity: 1
keywords: wb97x-d3
keywords: def2-TZVPP
keywords: def2/J RIJCOSX
keywords: DEFGRID2
keywords: scfconv7
keywords: smallprint printgap noloewdin
keywords: NOSOSCF
formula: C25H29FO2Si
InChI: InChI=1/C25H29FO2Si/c1-4-27-21-13-15-23(16-14-21)29(2,3)18-8-9-20-12-17-24(26)25(19-20)28-22-10-6-5-7-11-22/h5-7,10-17,19H,4,8-9,18H2,1-3H3
58 atoms
Si -4.084839 0.873971 0.751017
F  1.986864 -1.666849 1.173239
O  1.766706 2.400239 1.097213
O  1.549576 -0.119592 -1.063407
C  -4.192286 -0.864151 0.024733
C  -3.690271 -0.957086 -1.424725
C  -2.262545 1.33773 0.868629
C  -4.83672 0.885707 2.476291
C  -4.957864 2.108458 -0.367279
C  -2.817509 -2.188342 -1.695284
C  -1.444428 0.794097 1.85868
C  -1.657136 2.22525 -0.028575
C  -1.512027 -2.113877 -0.954268
C  -0.095572 1.112425 1.970887
C  -0.317997 2.561116 0.063882
C  0.474258 2.010598 1.071765
C  -0.531859 -1.213314 -1.371057
C  -1.267788 -2.879738 0.179974
C  0.650064 -1.068293 -0.668649
C  -0.086214 -2.741655 0.899062
C  0.853423 -1.831445 0.474755
C  2.630022 1.853974 2.088925
C  3.99302 2.480395 1.931549
C  2.829251 -0.473258 -1.396687
C  3.758279 0.560079 -1.413527
C  3.200501 -1.765362 -1.741086
C  5.071389 0.292152 -1.764877
C  4.522276 -2.017352 -2.08743
C  5.463039 -0.998117 -2.099557
H  -3.60081 -1.51123 0.682276
H  -5.21587 -1.242563 0.09567
H  -3.112183 -0.070822 -1.709916
H  -4.543749 -0.973688 -2.105423
H  -4.758836 1.868599 2.944639
H  -5.895326 0.619401 2.445839
H  -4.342867 0.168521 3.135209
H  -4.57073 2.082558 -1.387847
H  -6.026717 1.891605 -0.422848
H  -4.852375 3.131895 -0.002357
H  -3.357276 -3.09315 -1.406705
H  -2.625529 -2.261327 -2.768644
H  -1.854945 0.094281 2.578849
H  -2.241773 2.67981 -0.820116
H  0.486212 0.65759 2.760969
H  0.123282 3.25354 -0.642854
H  -0.690393 -0.602714 -2.252657
H  -2.009443 -3.592309 0.517824
H  0.096897 -3.328891 1.78959
H  2.69184 0.767904 1.975909
H  2.234149 2.060949 3.088301
H  3.956185 3.561993 2.06242
H  4.661107 2.076221 2.69173
H  4.429177 2.261328 0.956588
H  3.451068 1.564131 -1.150374
H  2.480462 -2.573829 -1.75318
H  5.791793 1.099677 -1.774023
H  4.812059 -3.025725 -2.352077
H  6.489708 -1.204811 -2.369734
elementType: Si F O C H
totalener: -1510.05375778 hartree
nucrepener: 3042.74825458 hartree
electener: -4552.80201236 hartree
oneelecener: -8117.24584332 hartree
twoeener: 3564.44383096 hartree
cpcmener: -0.02759074 hartree
kineticenergy: 1503.92325175 hartree
xcener: -135.235796776988 hartree
chargesum: 0.0000000
charge: 0.484535 -0.225212 -0.340373 -0.327826 -0.276418 -0.119868 -0.125792 -0.450229 -0.431637 -0.098183 -0.226883 -0.111177 0.078466 -0.192012 -0.269027 0.318649 -0.283120 -0.197719 0.182691 -0.142795 0.240250 0.025157 -0.271249 0.324943 -0.295856 -0.200000 -0.118737 -0.163588 -0.191295 0.079293 0.097513 0.063656 0.095247 0.103417 0.103957 0.101348 0.102039 0.108892 0.109513 0.088539 0.096071 0.136540 0.145120 0.138411 0.135073 0.132859 0.146977 0.147921 0.101777 0.114013 0.092016 0.094098 0.083080 0.150002 0.154823 0.160977 0.161175 0.159956
qa: 0.4845 -0.2252 -0.3404 -0.3278 -0.2764 -0.1199 -0.1258 -0.4502 -0.4316 -0.0982 -0.2269 -0.1112 0.0785 -0.1920 -0.2690 0.3186 -0.2831 -0.1977 0.1827 -0.1428 0.2403 0.0252 -0.2712 0.3249 -0.2959 -0.2000 -0.1187 -0.1636 -0.1913 0.0793 0.0975 0.0637 0.0952 0.1034 0.1040 0.1013 0.1020 0.1089 0.1095 0.0885 0.0961 0.1365 0.1451 0.1384 0.1351 0.1329 0.1470 0.1479 0.1018 0.1140 0.0920 0.0941 0.0831 0.1500 0.1548 0.1610 0.1612 0.1600
va: 4.1354 1.0489 2.0376 2.0060 3.8328 3.8682 3.6604 3.9065 3.9069 3.8571 3.9268 3.8183 3.5531 3.7893 4.0019 3.6932 4.0017 3.8961 3.5517 3.9252 3.8903 3.7800 3.9638 3.6577 3.9575 3.9035 3.8947 3.9117 3.9072 1.0166 1.0107 1.0070 1.0081 1.0092 1.0105 1.0108 1.0082 1.0091 1.0067 1.0065 1.0066 0.9952 0.9855 1.0102 1.0123 1.0198 1.0001 1.0000 0.9908 0.9919 1.0042 1.0059 1.0036 1.0171 1.0021 0.9896 0.9898 0.9895
dispcorr: -0.036189890 hartree
energy: -1510.089947674535
dipole: -18.65253 18.14341 -0.50912 7.42569 -8.50572 -1.08003 2.64241 -2.45999 0.18242
magnitude: 1.20787 au
magnitude: 3.07016 debye
