program: Orca
programVersion: 5.0.2
elementType: Si F O O C C C C C C C C C C C C C C C C C C C C C C C C C H H H H H H H H H H H H H H H H H H H H H H H H H H H H H
charge: 0
multiplicity: 1
keywords: wb97x-d3
keywords: def2-TZVPP
keywords: def2/J RIJCOSX
keywords: DEFGRID2
keywords: scfconv7
keywords: smallprint printgap noloewdin
keywords: NOSOSCF
formula: C25H29FO2Si
InChI: InChI=1/C25H29FO2Si/c1-4-27-21-13-15-23(16-14-21)29(2,3)18-8-9-20-12-17-24(26)25(19-20)28-22-10-6-5-7-11-22/h5-7,10-17,19H,4,8-9,18H2,1-3H3
58 atoms
Si -3.539809 1.790927 0.449396
F  1.468371 -5.368849 0.218462
O  2.207703 3.663713 0.032958
O  2.118646 -2.855113 -0.425173
C  -3.739754 0.296597 -0.685912
C  -2.792197 -0.844312 -0.318377
C  -1.754327 2.377555 0.289046
C  -3.844877 1.315415 2.24411
C  -4.731601 3.155379 -0.060484
C  -2.582375 -1.85938 -1.444765
C  -1.103457 3.050426 1.329957
C  -1.008109 2.14667 -0.865857
C  -1.508292 -2.84345 -1.080426
C  0.210714 3.4702 1.224886
C  0.314147 2.555374 -0.996445
C  0.933058 3.225576 0.055486
C  -0.190865 -2.399567 -0.981599
C  -1.793988 -4.166285 -0.764209
C  0.811779 -3.241326 -0.53313
C  -0.791173 -5.030294 -0.342695
C  0.495579 -4.555875 -0.215762
C  3.002178 3.400513 -1.119984
C  4.396276 3.909106 -0.855651
C  2.428987 -1.656675 0.173662
C  1.655225 -1.089054 1.178928
C  3.604662 -1.047371 -0.243246
C  2.069936 0.102696 1.759364
C  4.012187 0.135609 0.356977
C  3.248043 0.718238 1.359197
H  -4.778603 -0.047468 -0.677779
H  -3.548571 0.623984 -1.714585
H  -3.158852 -1.361254 0.57288
H  -1.811693 -0.443003 -0.043779
H  -4.848454 0.905742 2.377482
H  -3.134466 0.561947 2.589378
H  -3.75753 2.175283 2.911402
H  -4.607634 4.047285 0.556985
H  -4.578122 3.453677 -1.099444
H  -5.770026 2.831649 0.037348
H  -3.516933 -2.380736 -1.663359
H  -2.298923 -1.32062 -2.353494
H  -1.626384 3.254169 2.257897
H  -1.452678 1.625239 -1.706411
H  0.68703 3.986107 2.0498
H  0.838076 2.342195 -1.918158
H  0.047895 -1.372977 -1.237837
H  -2.809879 -4.532245 -0.840222
H  -1.01144 -6.060881 -0.096264
H  2.570905 3.899694 -1.993703
H  3.021913 2.326173 -1.327657
H  4.404866 4.983593 -0.670931
H  4.853214 3.406179 -0.002645
H  5.01954 3.716902 -1.728667
H  0.74032 -1.557759 1.517187
H  4.19961 -1.498336 -1.027233
H  1.464039 0.545059 2.539395
H  4.93149 0.605181 0.031342
H  3.567767 1.641272 1.823627
elementType: Si F O C H
totalener: -1510.05409059 hartree
nucrepener: 2922.67909015 hartree
electener: -4432.73318074 hartree
oneelecener: -7875.52132075 hartree
twoeener: 3442.78814001 hartree
cpcmener: -0.02805537 hartree
kineticenergy: 1503.91519339 hartree
xcener: -135.232206879716 hartree
chargesum: 0.0000000
charge: 0.492935 -0.220003 -0.336573 -0.343878 -0.272485 -0.146425 -0.154787 -0.441960 -0.423500 -0.051716 -0.093020 -0.156087 0.019542 -0.302288 -0.243754 0.329937 -0.233370 -0.204838 0.220022 -0.163636 0.176586 0.018350 -0.272062 0.320974 -0.206993 -0.248062 -0.170272 -0.149985 -0.160275 0.095367 0.079136 0.100215 0.061784 0.111087 0.108783 0.106383 0.100107 0.101446 0.102526 0.084594 0.089143 0.137158 0.143202 0.133879 0.138946 0.148245 0.143704 0.150318 0.121648 0.101001 0.094100 0.082804 0.094090 0.157119 0.148255 0.161328 0.162981 0.158272
qa: 0.4929 -0.2200 -0.3366 -0.3439 -0.2725 -0.1464 -0.1548 -0.4420 -0.4235 -0.0517 -0.0930 -0.1561 0.0195 -0.3023 -0.2438 0.3299 -0.2334 -0.2048 0.2200 -0.1636 0.1766 0.0183 -0.2721 0.3210 -0.2070 -0.2481 -0.1703 -0.1500 -0.1603 0.0954 0.0791 0.1002 0.0618 0.1111 0.1088 0.1064 0.1001 0.1014 0.1025 0.0846 0.0891 0.1372 0.1432 0.1339 0.1389 0.1482 0.1437 0.1503 0.1216 0.1010 0.0941 0.0828 0.0941 0.1571 0.1483 0.1613 0.1630 0.1583
va: 4.1305 1.0648 2.0342 2.0709 3.8686 3.8714 3.7131 3.8939 3.8947 3.7906 3.8425 3.8659 3.6652 4.0106 3.8701 3.6887 3.9202 3.9079 3.6649 3.8652 4.0672 3.7937 3.9636 3.6632 3.8781 4.0133 3.8805 3.8560 3.8046 1.0142 1.0157 1.0086 0.9953 1.0078 1.0046 1.0095 1.0099 1.0089 1.0088 1.0136 1.0096 0.9895 0.9894 1.0154 1.0126 1.0011 1.0028 0.9974 0.9921 0.9791 1.0046 1.0028 1.0050 0.9980 1.0074 0.9932 0.9873 0.9969
dispcorr: -0.032838309 hartree
energy: -1510.086928900674
dipole: -16.27430 15.38768 -0.88662 29.52568 -28.72036 0.80532 -1.22534 0.47750 -0.74784
magnitude: 1.41206 au
magnitude: 3.58917 debye
