program: Orca
programVersion: 5.0.2
elementType: Si F O O C C C C C C C C C C C C C C C C C C C C C C C C C H H H H H H H H H H H H H H H H H H H H H H H H H H H H H
charge: 0
multiplicity: 1
keywords: wb97x-d3
keywords: def2-TZVPP
keywords: def2/J RIJCOSX
keywords: DEFGRID2
keywords: scfconv7
keywords: smallprint printgap noloewdin
keywords: NOSOSCF
formula: C25H29FO2Si
InChI: InChI=1/C25H29FO2Si/c1-4-27-21-13-15-23(16-14-21)29(2,3)18-8-9-20-12-17-24(26)25(19-20)28-22-10-6-5-7-11-22/h5-7,10-17,19H,4,8-9,18H2,1-3H3
58 atoms
Si -3.381855 0.265887 1.706931
F  2.501716 -0.298463 -1.862065
O  1.098245 3.578713 -0.642008
O  1.762042 -2.787469 -0.998366
C  -3.338455 -1.241629 0.570458
C  -3.71528 -0.905956 -0.877785
C  -1.996397 1.382404 1.089303
C  -3.040228 -0.254616 3.482024
C  -5.029398 1.161363 1.569486
C  -2.938303 -1.716043 -1.921065
C  -2.221376 2.473958 0.243649
C  -0.665878 1.06697 1.364201
C  -1.477776 -1.356772 -1.931543
C  -1.17901 3.197182 -0.310081
C  0.398568 1.777164 0.823051
C  0.142425 2.845205 -0.033513
C  -0.514879 -2.234781 -1.442168
C  -1.066524 -0.104381 -2.385678
C  0.825319 -1.881301 -1.420302
C  0.269869 0.263919 -2.365496
C  1.20224 -0.631736 -1.887573
C  2.463855 3.228186 -0.444564
C  3.309812 4.165622 -1.269001
C  2.563177 -2.46092 0.069348
C  2.15329 -1.592325 1.070815
C  3.807786 -3.073666 0.125815
C  3.011354 -1.324962 2.12902
C  4.649733 -2.80437 1.194467
C  4.261283 -1.924155 2.196552
H  -2.313127 -1.62659 0.622578
H  -3.97221 -2.048579 0.949038
H  -3.555915 0.155525 -1.097692
H  -4.785105 -1.071759 -1.02135
H  -2.997546 0.602697 4.156198
H  -3.821922 -0.922705 3.849904
H  -2.092076 -0.788805 3.570891
H  -5.257167 1.442477 0.539338
H  -5.845883 0.525296 1.917806
H  -5.047709 2.072976 2.169681
H  -3.057415 -2.78405 -1.725097
H  -3.364149 -1.526096 -2.909667
H  -3.234658 2.770932 -0.002132
H  -0.431643 0.234317 2.019545
H  -1.381307 4.031958 -0.97027
H  1.40912 1.478402 1.068666
H  -0.803187 -3.213636 -1.077891
H  -1.798061 0.598279 -2.765285
H  0.588427 1.2349 -2.722791
H  2.636082 2.191609 -0.750112
H  2.725555 3.308837 0.61535
H  3.084353 4.07883 -2.332221
H  3.170652 5.203803 -0.966323
H  4.361685 3.917098 -1.130463
H  1.175012 -1.1306 1.04137
H  4.112855 -3.752547 -0.660495
H  2.691497 -0.642818 2.90607
H  5.620163 -3.281439 1.236215
H  4.925992 -1.710705 3.022679
elementType: Si F O C H
totalener: -1510.05365534 hartree
nucrepener: 3018.37692526 hartree
electener: -4528.43058060 hartree
oneelecener: -8067.18626929 hartree
twoeener: 3538.75568869 hartree
cpcmener: -0.02667740 hartree
kineticenergy: 1503.91535139 hartree
xcener: -135.233468236070 hartree
chargesum: -0.0000000
charge: 0.480614 -0.223058 -0.341891 -0.342428 -0.259194 -0.126147 -0.143102 -0.445630 -0.430250 -0.092458 -0.101583 -0.159823 0.079207 -0.292490 -0.269107 0.352260 -0.275257 -0.273053 0.236424 -0.131959 0.219263 0.059414 -0.276273 0.240588 -0.148044 -0.218660 -0.191180 -0.144375 -0.166356 0.076638 0.095234 0.065873 0.093634 0.104101 0.104437 0.100148 0.100933 0.109339 0.110177 0.084980 0.098837 0.144692 0.148731 0.132345 0.133997 0.136001 0.145266 0.154308 0.086721 0.104414 0.087682 0.089043 0.091096 0.155985 0.147667 0.160435 0.160364 0.161472
qa: 0.4806 -0.2231 -0.3419 -0.3424 -0.2592 -0.1261 -0.1431 -0.4456 -0.4303 -0.0925 -0.1016 -0.1598 0.0792 -0.2925 -0.2691 0.3523 -0.2753 -0.2731 0.2364 -0.1320 0.2193 0.0594 -0.2763 0.2406 -0.1480 -0.2187 -0.1912 -0.1444 -0.1664 0.0766 0.0952 0.0659 0.0936 0.1041 0.1044 0.1001 0.1009 0.1093 0.1102 0.0850 0.0988 0.1447 0.1487 0.1323 0.1340 0.1360 0.1453 0.1543 0.0867 0.1044 0.0877 0.0890 0.0911 0.1560 0.1477 0.1604 0.1604 0.1615
va: 4.1395 1.0571 2.0493 2.0591 3.8232 3.8956 3.6902 3.9055 3.9082 3.8386 3.8254 3.8496 3.5717 4.0361 3.8320 3.6923 4.0015 3.9080 3.6946 3.8092 3.9487 3.7790 3.9735 3.7263 3.8212 3.9753 3.9238 3.9052 3.8782 1.0151 1.0111 1.0050 1.0087 1.0098 1.0107 1.0114 1.0085 1.0086 1.0074 1.0091 1.0040 0.9858 0.9772 1.0153 1.0118 1.0167 1.0035 0.9922 0.9912 0.9904 1.0031 1.0037 1.0055 0.9919 1.0081 0.9928 0.9881 0.9885
dispcorr: -0.035378651 hartree
energy: -1510.089033996268
dipole: -18.49441 18.03201 -0.46240 9.01004 -8.99960 0.01044 11.10513 -10.69401 0.41112
magnitude: 0.61883 au
magnitude: 1.57293 debye
